program: Gaussian 09
title: 000144471
version: EM64L-G09RevD.01
frameworkgroup: C1[X(C19H30N2)]
method: RPBEPBE
basis: SDD
operation: Freq
keyword: #pfreq=noraman
keyword: PBEPBE/SDD
title: #p freq=noraman PBEPBE/SDD
converged: YES YES NO NO
title: Mulliken charges:
elementType: N N C C C C C C C C C C C C C C C C C C C H H H H H H H H H H H H H H H H H H H H H H H H H H H H H H
charge: -0.261755 -0.717031 0.210320 0.270932 0.294871 0.165903 -0.396533 -0.409615 -0.410996 -0.418215 -0.469785 -0.620507 -0.372776 -0.740620 -0.746787 -0.742104 -0.724081 0.530297 -0.503238 -0.021140 -0.620997 0.201959 0.211594 0.186052 0.226403 0.215216 0.202935 0.225001 0.190205 0.221926 0.208887 0.229203 0.239912 0.217095 0.244076 0.213272 0.215125 0.230717 0.218319 0.244177 0.214244 0.211193 0.229107 0.225307 0.200767 0.214681 0.230476 0.302723 0.302298 0.216396 0.214591
chargesum: 0.00000
title: Mulliken charges with hydrogens summed into heavy atoms:
elementType: N N C C C C C C C C C C C C C C C C C C C
charge: -0.261755 -0.112010 0.210320 0.270932 0.294871 0.165903 0.017021 0.002839 0.007155 -0.003009 -0.038972 -0.391304 -0.132864 -0.066177 -0.082626 -0.072490 -0.068899 0.530297 -0.288557 0.209336 -0.190010
polarizability: 2.74143770e+02 -8.62131736e+00 2.22563528e+02 8.54655075e+00 -2.97169056e-01 1.65543052e+02
1716.lowfreq: -11.1182 -8.3225 -0.0006 -0.0003 0.0008 6.2457 36.0989 51.9975 63.7281
frequency: 36.0728 51.9875 63.6980 74.9451 79.5123 84.1810 95.9596 110.3815 121.5641 154.6136 168.3634 178.0375 187.4737 196.9957 218.6134 228.2125 249.9121 259.9304 262.7325 274.9846 287.4892 291.0917 300.6752 315.5631 323.4313 330.4143 354.4063 356.3645 371.6728 382.2049 411.2730 439.0825 465.5108 484.0681 533.7875 539.0627 573.5290 601.0321 620.5003 634.6267 658.9539 706.3296 729.7926 756.4584 765.3249 778.8322 789.9429 816.9728 830.5145 864.6379 868.6163 907.1992 909.3099 923.1338 924.3786 931.6875 940.8197 946.9188 952.3927 1006.9514 1021.5519 1029.1258 1032.3013 1042.7494 1047.2098 1059.5797 1062.0582 1063.9861 1076.2431 1096.9844 1104.3517 1117.1346 1133.4762 1146.6182 1159.7540 1160.7779 1177.5060 1203.0969 1237.7702 1258.5038 1266.6830 1271.6508 1275.1942 1281.0150 1293.9521 1307.2233 1319.3532 1326.8206 1333.1740 1336.5389 1345.7756 1356.2166 1378.3698 1382.0099 1385.1561 1387.3018 1392.8200 1421.3673 1450.0102 1451.6491 1455.6582 1463.5988 1464.7660 1466.9796 1473.8357 1479.3065 1479.5700 1481.6095 1489.8263 1490.7659 1491.9216 1501.1472 1502.6666 1593.5484 1633.8081 1642.3355 1649.0449 2901.0382 2967.7533 2973.5192 2976.8096 2977.3811 2977.5460 2979.4493 2981.2523 2983.7609 3022.9084 3027.7722 3032.7042 3034.8068 3035.5332 3060.8110 3065.0383 3065.5101 3070.9706 3079.3415 3079.7546 3081.7375 3084.0684 3084.8632 3095.4519 3115.0132 3120.7954 3141.6515 3191.1977 3570.0876 3710.9809
redmass: 3.8037 3.1788 3.5800 2.2192 2.3549 3.3230 2.6490 2.1811 2.2020 2.6253 1.2696 3.0906 2.3514 1.9266 1.9529 1.7541 1.7702 1.9218 1.5998 1.5342 2.6726 2.6837 1.9694 2.5970 1.7271 1.9475 1.5173 1.7321 3.1052 2.5135 2.9892 3.3483 2.9053 3.2753 2.4811 3.2190 2.5395 3.0089 2.8872 2.5984 2.9139 3.6789 1.6244 2.0967 1.8402 1.3498 1.3281 1.4816 2.5149 1.8107 1.6028 1.7733 1.6975 1.9959 1.8159 1.6532 1.6876 1.6383 1.8172 1.1663 1.6349 1.6258 1.5988 2.4924 2.4478 2.1056 2.1271 2.2670 2.2543 2.2255 2.5854 2.0971 2.0123 2.2004 3.2051 1.5686 3.4807 2.4487 1.6618 1.3238 1.3102 1.2214 1.3349 1.2190 1.2598 1.5043 1.4323 1.7826 1.5201 1.3481 1.4266 1.9286 1.2210 1.2142 1.2320 1.2143 5.5923 1.2003 1.2469 1.2319 1.7839 1.0591 1.0665 1.1506 1.0730 1.0527 1.0429 1.0501 1.0720 1.0646 1.0643 1.3438 1.9070 7.6193 2.4818 1.6420 4.6198 1.0707 1.0576 1.0413 1.0542 1.0411 1.0471 1.0373 1.0501 1.0539 1.1006 1.0978 1.0880 1.0981 1.0973 1.0979 1.0985 1.0984 1.0991 1.0651 1.0996 1.0948 1.0999 1.1000 1.0932 1.0871 1.0905 1.0957 1.1136 1.0447 1.1040
irintensity: 0.0743 0.1009 1.0282 0.0266 0.0761 0.4045 0.3448 0.8958 0.3155 0.0564 0.2505 0.7414 0.7360 0.2626 1.9160 0.5382 0.2841 5.2610 0.3412 0.1309 0.4383 2.1470 3.5212 5.2933 123.9858 158.9405 0.7429 3.4833 1.8153 0.5654 1.0385 5.3994 5.4508 1.0374 5.8959 11.3278 0.7175 3.0740 2.3947 3.7379 2.7384 2.7417 8.6844 5.4436 4.5749 4.3984 5.8464 43.1788 9.1463 17.6224 30.0466 6.3001 7.7717 3.1801 15.3420 31.5947 84.2789 3.8210 2.0678 12.9075 18.5413 2.0619 0.4372 4.7423 0.9033 13.3902 1.7880 3.6832 5.0537 13.3253 8.1218 23.1540 5.1430 0.0366 7.7902 4.9718 63.3084 6.3947 0.7148 3.1913 1.9461 0.3035 10.5348 0.8063 15.4884 1.2392 3.8695 10.8823 11.2926 0.3010 4.9958 66.4382 17.4641 13.4458 21.8694 18.5989 16.0565 13.7183 12.9452 6.0085 7.2427 0.3462 9.3627 5.4256 6.4586 5.6508 5.1701 9.3428 16.8911 6.3193 13.7708 33.5395 71.2147 15.0737 11.0092 314.1410 12.3080 61.6291 32.2360 27.5496 67.9921 29.2416 18.1871 40.1238 44.2625 31.8648 14.6202 9.8847 30.8112 14.7545 18.8588 53.9379 6.4350 72.9086 48.5864 26.6406 36.2191 39.6027 54.8228 45.7778 8.8887 14.7422 27.0627 22.8193 27.3346 66.8962 17.8427
temp: 298.150 k
press: 1.00000 atm
elementType: 7 7 6 6 6 6 6 6 6 6 6 6 6 6 6 6 6 6 6 6 6 1 1 1 1 1 1 1 1 1 1 1 1 1 1 1 1 1 1 1 1 1 1 1 1 1 1 1 1 1 1
symmnumber: 1
zpe: 1173333.7 jmol-1
zpe.correction: 0.446899 hartree
zpe.thermalcorrener: 0.470689 hartree
zpe.thermalcorrenthalpy: 0.471633 hartree
zpe.thermalcorrgfe: 0.395848 hartree
zpe.sumelectzpe: -849.863593 hartree
zpe.sumelectthermal: -849.839803 hartree
zpe.sumelectthermalent: -849.838859 hartree
zpe.sumelectthermalfe: -849.914644 hartree
dipole: -2.4158 0.7197 0.4431
dipole: 2.5594
quadrupole: -112.0466 -125.3060 -133.5966
quadrupole: -1.5599 3.5780 0.1566
quadrupole: 11.6031 -1.6563 -9.9469 -1.5599 3.5780 0.1566
hfenergy: -850.3104919 hartree
pointgroup: C01 [X(C19H30N2)]
dipole: 0.9516533 0.2834903 -0.1670306 debye
polarizability: 273.7104158|9.2486867|222.6400485|10.1336005|-1.3303019|165.8998847 unknown
InChI: InChI=1S/C19H30N2/c1-6-13-21-18(7-2,8-3)16-12-11-15(20)14-17(16)19(21,9-4)10-5/h6,11-12,14H,1,7-10,13,20H2,2-5H3
charge 0 multiplicity 1
51 atoms
N  -1.180684 0.352586 0.052107
N  4.856893 -0.006944 0.491322
C  -0.020146 1.312137 -0.125177
C  -0.76335 -1.100073 -0.080458
C  1.172671 0.36458 0.024156
C  0.750986 -0.983091 0.043983
C  -0.040256 1.979041 -1.55258
C  0.034085 2.374032 1.02543
C  -1.198314 -1.691488 -1.474243
C  -1.367642 -1.97177 1.070437
C  -2.510648 0.758205 -0.443953
C  2.529931 0.70334 0.180957
C  1.705361 -2.004702 0.231344
C  1.09698 2.970451 -1.880001
C  -1.100818 3.418712 1.104746
C  -0.691981 -3.108934 -1.820997
C  -1.042455 -1.472364 2.491218
C  3.501945 -0.325894 0.343141
C  3.071894 -1.684597 0.369064
C  -3.668885 0.235891 0.390277
C  -4.822234 -0.266937 -0.117619
H  -1.00531 2.506588 -1.681759
H  -0.029486 1.160851 -2.299513
H  0.999591 2.91276 0.945693
H  0.071526 1.807552 1.9751
H  -2.306121 -1.698755 -1.512187
H  -0.852484 -0.991553 -2.261234
H  -2.464391 -2.017887 0.930524
H  -0.993307 -3.008585 0.953289
H  -2.553006 1.861501 -0.393524
H  -2.693928 0.498192 -1.512323
H  2.852363 1.751052 0.207128
H  1.394196 -3.053609 0.293618
H  1.111683 3.829412 -1.184019
H  2.084693 2.479141 -1.845293
H  0.963328 3.375173 -2.900822
H  -1.232185 3.971511 0.155324
H  -2.06626 2.955752 1.374212
H  -0.869325 4.164541 1.888223
H  0.410553 -3.147058 -1.857376
H  -1.041236 -3.86482 -1.094342
H  -1.068901 -3.411344 -2.816099
H  0.043465 -1.513024 2.691846
H  -1.366162 -0.423146 2.610882
H  -1.55576 -2.089426 3.2523
H  3.810829 -2.48265 0.513265
H  -3.536425 0.326221 1.479161
H  5.550067 -0.735981 0.627301
H  5.168659 0.959147 0.483881
H  -5.648578 -0.580963 0.529591
H  -4.972221 -0.378375 -1.199698
