program: Gaussian 09
title: 000144454
version: EM64L-G09RevD.01
frameworkgroup: C1[X(C11H21N)]
method: RPBEPBE
basis: SDD
operation: Freq
keyword: #pfreq=noraman
keyword: PBEPBE/SDD
title: #p freq=noraman PBEPBE/SDD
converged: YES YES NO NO
title: Mulliken charges:
elementType: N C C C C C C C C C C C H H H H H H H H H H H H H H H H H H H H H
charge: -0.141354 -0.081999 -0.130890 -0.500395 -0.449719 -0.474595 -0.434262 -0.382645 0.324775 -0.758720 -0.712082 -0.712356 0.208483 0.227779 0.213501 0.220641 0.226513 0.204801 0.219545 0.206670 0.203428 0.191946 0.168512 0.226901 0.229246 0.211284 0.220173 0.213805 0.223194 0.201223 0.215741 0.210675 0.210182
chargesum: 0.00000
title: Mulliken charges with hydrogens summed into heavy atoms:
elementType: N C C C C C C C C C C C
charge: -0.141354 0.126484 0.096889 -0.066253 -0.018405 -0.048381 -0.038888 0.012768 0.324775 -0.098017 -0.073860 -0.075757
polarizability: 1.36029106e+02 -1.61304559e-01 1.16645721e+02 -6.81244743e-01 2.94476343e-01 1.06536662e+02
1716.lowfreq: -22.8344 -20.8855 -0.0007 -0.0004 -0.0003 6.8868 36.1883 77.4223 134.3881
frequency: 35.4251 77.3218 134.2991 185.6935 214.1538 236.0977 245.5040 282.9994 302.0008 320.4441 341.4616 363.2603 393.6973 422.6006 453.7181 466.1358 482.4242 525.6271 634.4731 698.0339 754.3776 767.8946 780.4733 800.1208 874.9304 883.7733 889.9286 908.9476 917.0072 928.1548 938.4275 968.0943 972.3266 989.2781 1010.4996 1014.5121 1034.5154 1059.2837 1080.2506 1093.0172 1110.6174 1144.5334 1160.8915 1174.5051 1187.6355 1198.7915 1220.7889 1227.8087 1236.2488 1248.0299 1271.1616 1279.2932 1294.8899 1302.1938 1315.3921 1328.3301 1338.7661 1362.9746 1370.7742 1373.6736 1396.5808 1453.1996 1455.2129 1458.2523 1462.7717 1464.4683 1470.1347 1479.1036 1481.0303 1484.2838 1496.9310 1502.2732 2829.1166 2970.7011 2978.1253 2981.1445 2982.5086 2983.5321 2996.3589 2997.7458 3023.9836 3035.4834 3043.1044 3044.9292 3053.1131 3062.8054 3065.3529 3068.5854 3074.4343 3079.4156 3084.1146 3085.3116 3088.7694
redmass: 2.7400 2.6720 2.0775 1.2492 1.9591 1.3308 1.5213 1.4225 1.7874 2.4022 2.1120 2.1194 2.3592 1.9935 2.8221 2.6825 2.8419 2.7392 3.2756 2.8867 2.0836 2.3814 2.3225 2.0675 2.5598 2.2786 1.7717 2.1764 1.6215 2.1889 1.2635 1.7007 2.2566 1.7518 1.5171 1.4543 2.1253 1.6368 1.9660 1.8002 1.6587 1.7867 1.2395 1.3331 1.8420 1.9294 2.0298 1.8278 1.3443 1.6990 2.0330 1.3701 1.6161 1.5431 1.3702 1.3419 1.3802 1.3365 1.2272 1.2364 1.2034 1.0823 1.0564 1.0854 1.0510 1.0901 1.0485 1.0608 1.0734 1.0689 1.0557 1.0767 1.0725 1.0348 1.0351 1.0628 1.0607 1.0366 1.0637 1.0643 1.0866 1.0894 1.0929 1.0923 1.1004 1.1001 1.1017 1.0997 1.0990 1.0990 1.0995 1.0993 1.0990
irintensity: 0.1169 0.1441 0.8139 0.0057 0.0283 0.8170 0.7284 0.2824 0.2182 1.1909 0.2847 1.6408 0.8164 0.4083 0.1185 0.0274 7.1601 0.1450 0.7402 1.0316 0.7753 0.1146 6.9348 2.0100 2.0732 6.5006 1.9270 6.0821 2.5075 1.9759 0.3602 4.1189 19.5206 0.8181 2.5759 1.6126 0.5021 6.2128 2.3158 5.0360 10.5351 7.4295 11.4301 7.3238 43.7224 41.1731 21.4024 15.4387 8.6627 22.1694 18.4352 0.7908 3.2513 5.8716 2.8595 8.8674 2.2008 5.1134 27.9261 22.5947 24.8267 5.2617 1.3515 5.5612 1.2228 8.9837 0.4446 12.0152 14.1129 5.0377 13.6511 5.7998 97.2025 29.4303 29.8779 43.0322 10.2764 22.3473 27.8737 68.0094 98.5272 79.1995 12.9810 17.8692 40.3602 28.9622 24.2759 15.8161 33.5620 59.9899 76.6941 22.1778 58.6946
temp: 298.150 k
press: 1.00000 atm
elementType: 7 6 6 6 6 6 6 6 6 6 6 6 1 1 1 1 1 1 1 1 1 1 1 1 1 1 1 1 1 1 1 1 1
symmnumber: 1
zpe: 788108.0 jmol-1
zpe.correction: 0.300174 hartree
zpe.thermalcorrener: 0.312597 hartree
zpe.thermalcorrenthalpy: 0.313541 hartree
zpe.thermalcorrgfe: 0.262504 hartree
zpe.sumelectzpe: -485.514795 hartree
zpe.sumelectthermal: -485.502373 hartree
zpe.sumelectthermalent: -485.501428 hartree
zpe.sumelectthermalfe: -485.552465 hartree
dipole: -0.1106 0.2142 0.6363
dipole: 0.6805
quadrupole: -75.0607 -75.5471 -77.4093
quadrupole: 0.0467 0.7045 -0.9255
quadrupole: 0.9450 0.4586 -1.4036 0.0467 0.7045 -0.9255
hfenergy: -485.8149691 hartree
pointgroup: C01 [X(C11H21N1)]
dipole: 0.0403316 -0.0981107 0.2457975 debye
polarizability: 136.0059052|-0.1740043|116.6463619|1.0723233|0.2718852|106.5592221 unknown
InChI: InChI=1S/C11H21N/c1-11(2,3)12-7-6-9-4-5-10(12)8-9/h9-10H,4-8H2,1-3H3
charge 0 multiplicity 1
33 atoms
N  0.451092 -0.129037 -0.205634
C  -0.463704 0.804104 0.544815
C  -2.38491 -0.551056 0.215823
C  -1.522659 0.021671 1.371548
C  -1.361962 1.61359 -0.446008
C  -2.63937 0.725944 -0.647248
C  -1.533462 -1.616705 -0.550924
C  -0.02351 -1.534258 -0.206069
C  1.928368 0.080718 0.011042
C  2.728748 -0.883245 -0.90593
C  2.295881 1.529135 -0.411293
C  2.359491 -0.163091 1.493729
H  0.133136 1.47852 1.183267
H  -3.33533 -0.996023 0.561983
H  -2.108725 0.7258 1.992651
H  -1.090513 -0.745757 2.037331
H  -0.812615 1.788947 -1.385076
H  -1.630349 2.597586 -0.013959
H  -3.541736 1.254619 -0.285366
H  -2.812776 0.469874 -1.707923
H  -1.668541 -1.479325 -1.640581
H  -1.881541 -2.639115 -0.305691
H  0.149324 -2.053591 0.771888
H  0.539669 -2.106385 -0.963104
H  2.351974 -0.826469 -1.943236
H  3.794658 -0.591501 -0.907117
H  2.673853 -1.932338 -0.564918
H  1.757905 2.289687 0.180868
H  2.045651 1.684991 -1.475916
H  3.37914 1.701984 -0.271187
H  2.082941 -1.182812 1.821118
H  3.454848 -0.057803 1.606817
H  1.880825 0.56004 2.179699
