program: Gaussian 09
title: 000144434
version: EM64L-G09RevD.01
frameworkgroup: C1[X(C13H12N4O2)]
method: RPBEPBE
basis: SDD
operation: Freq
keyword: #p
keyword: freq=noraman
keyword: PBEPBE/SDD
title: #p freq=noraman PBEPBE/SDD
converged: NO NO NO NO
title: Mulliken charges:
elementType: O O N N N N C C C C C C C C C C C C C H H H H H H H H H H H H
charge: -0.219203 -0.215952 -0.181445 0.117748 -0.230944 -0.085754 0.334250 -0.160409 0.164314 -0.130037 0.413796 -0.361639 0.171001 -0.667077 -0.425012 -0.221156 0.024825 -0.783892 -0.599729 0.262723 0.243293 0.243324 0.324302 0.248576 0.236859 0.256372 0.256303 0.214363 0.252729 0.264721 0.252751
chargesum: 0.00000
title: Mulliken charges with hydrogens summed into heavy atoms:
elementType: O O N N N N C C C C C C C C C C C C C
charge: -0.219203 -0.215952 -0.181445 0.117748 -0.230944 -0.085754 0.334250 -0.160409 0.164314 -0.130037 0.413796 -0.098916 0.171001 0.143842 -0.176436 0.015703 0.024825 -0.056855 0.170472
polarizability: 3.30596231e+02 -4.66141515e+00 1.91736682e+02 1.87282876e-02 -4.36056706e-03 7.96958086e+01
1716.lowfreq: -9.2637 -0.0006 -0.0005 0.0004 2.1514 8.1165 40.5487 63.9285 79.7697
frequency: 40.5309 63.9011 79.7615 94.4824 99.4021 127.3160 159.4977 164.8453 191.6468 222.0678 247.8043 268.0222 310.0895 318.6193 335.8266 338.2140 344.0020 390.1843 405.8009 459.4595 489.9104 505.6226 519.1239 541.6723 551.2277 569.8954 599.4648 657.4230 679.2065 722.9958 729.4790 760.5785 761.4726 783.1788 798.4309 834.8190 891.0386 902.1210 947.8592 982.9254 983.5423 1012.8046 1043.0096 1046.1721 1086.6022 1104.2482 1121.6701 1125.3144 1157.5254 1188.9801 1190.7548 1230.7818 1248.9055 1266.6590 1305.0213 1324.8751 1338.6783 1388.8826 1403.5307 1416.0810 1420.0369 1437.5192 1452.1352 1462.2487 1466.3186 1471.2018 1475.0568 1481.4133 1500.1708 1509.7592 1547.8154 1571.5837 1578.3466 1608.2227 1621.0726 2994.2437 2996.3009 3012.9339 3079.4486 3088.4348 3101.5604 3104.3402 3121.2768 3137.2483 3139.8206 3156.7429 3182.5246
redmass: 6.4392 3.3153 1.4698 1.5616 1.2427 4.7798 4.5042 8.8283 1.8684 1.5692 3.5304 3.8818 5.2347 5.0316 5.7135 3.9266 3.4821 7.5288 5.6093 5.7605 6.2528 7.3101 6.4165 4.3435 5.9958 3.7360 8.7121 7.5592 7.5282 11.3510 5.3373 8.0265 3.0671 2.2566 3.5509 5.2558 1.3532 5.1952 3.1648 1.3460 2.4924 2.7241 3.1248 1.5768 1.8950 3.0179 1.3197 1.3158 2.8366 2.0455 1.9255 2.8831 6.7354 2.0569 3.9590 4.4972 4.1291 4.5018 1.3226 1.4020 1.2276 2.0291 1.0445 1.8650 1.4954 1.0436 1.0981 1.3778 1.0456 5.2272 8.8425 7.9736 9.1742 6.3221 10.5024 1.0335 1.0365 1.0328 1.0961 1.1025 1.1014 1.1018 1.1011 1.0875 1.1024 1.0945 1.0954
irintensity: 0.4443 1.7429 3.5884 7.1791 0.1995 0.0667 0.2218 0.8082 0.1757 0.2419 1.8079 6.0741 0.3501 0.7436 8.6059 3.2273 4.2291 31.3045 2.3123 4.4048 0.8964 6.3890 6.9993 1.8578 5.9325 0.1232 7.3550 0.0393 0.8991 9.9200 0.8426 9.0686 31.2030 18.6303 32.7028 0.8368 0.0966 3.2140 35.7150 0.6283 34.3581 32.5853 35.3514 10.0345 3.3411 45.8673 0.0274 0.1407 40.8220 75.9453 13.3718 35.6451 60.2177 14.1213 6.1437 29.6469 46.8192 36.4708 12.1212 42.7179 102.8261 51.6386 14.7912 26.8910 69.2073 16.9436 14.6980 28.5486 20.4588 21.6559 815.7232 259.1269 346.5479 0.4188 44.2863 31.1016 13.5246 27.9745 7.0189 15.3760 24.5859 15.8506 1.9422 4.8557 2.0190 20.0960 9.7044
temp: 298.150 k
press: 1.00000 atm
elementType: 8 8 7 7 7 7 6 6 6 6 6 6 6 6 6 6 6 6 6 1 1 1 1 1 1 1 1 1 1 1 1
symmnumber: 1
zpe: 613634.8 jmol-1
zpe.correction: 0.233721 hartree
zpe.thermalcorrener: 0.250156 hartree
zpe.thermalcorrenthalpy: 0.251100 hartree
zpe.thermalcorrgfe: 0.189844 hartree
zpe.sumelectzpe: -870.726442 hartree
zpe.sumelectthermal: -870.710007 hartree
zpe.sumelectthermalent: -870.709063 hartree
zpe.sumelectthermalfe: -870.770319 hartree
dipole: 7.3757 1.9912 -0.0023
dipole: 7.6398
quadrupole: -105.3981 -113.3612 -110.0352
quadrupole: 12.3551 0.0118 -0.0031
quadrupole: 4.2001 -3.7631 -0.4370 12.3551 0.0118 -0.0031
hfenergy: -870.960163 hartree
pointgroup: C01 [X(C13H12N4O2)]
dipole: 2.9112305 0.7477614 -0.0009021 debye
polarizability: 330.4609894|-6.3631843|191.8719238|0.0186734|-0.00459|79.6958086 unknown
InChI: InChI=1S/C13H12N4O2/c1-7-5-4-6-8-9(7)14-10-11(16(8)2)15-13(19)17(3)12(10)18/h4-6H,1-3H3
charge 0 multiplicity 1
31 atoms
O  -1.977417 -2.613471 -0.00021
O  -4.189822 1.511879 0.000441
N  0.501194 1.578007 -0.000539
N  0.513444 -1.263467 -0.000236
N  -3.082819 -0.541589 -0.000956
N  -1.854246 1.574629 -0.00045
C  1.72953 0.894764 -0.000193
C  1.710256 -0.550077 -0.000009
C  -0.720834 0.881067 -0.000591
C  -0.62805 -0.58444 -0.000611
C  2.937023 -1.296924 0.000375
C  2.970203 1.583106 0.000038
C  -1.922695 -1.353325 -0.001032
C  0.467627 3.058509 -0.000734
C  4.149877 -0.582574 0.000587
C  4.161881 0.837876 0.000413
C  -3.084613 0.90539 -0.00056
C  2.898027 -2.808514 0.000469
C  -4.408337 -1.202725 -0.000721
H  3.009389 2.674437 -0.000044
H  0.968603 3.451569 -0.902362
H  0.967694 3.451825 0.901291
H  -0.591413 3.355874 -0.001237
H  5.096395 -1.133104 0.000908
H  5.120599 1.368252 0.0006
H  2.349523 -3.190746 0.879199
H  2.351859 -3.19085 -0.879697
H  3.917981 -3.227911 0.001788
H  -4.978711 -0.899601 0.89254
H  -4.24131 -2.289611 -0.002463
H  -4.980239 -0.896754 -0.892004
