program: Gaussian 09
title: 000144428
version: EM64L-G09RevD.01
frameworkgroup: C1[X(C16H17N)]
method: RPBEPBE
basis: SDD
operation: Freq
keyword: #pfreq=noraman
keyword: PBEPBE/SDD
title: #p freq=noraman PBEPBE/SDD
converged: YES YES NO NO
title: Mulliken charges:
elementType: N C C C C C C C C C C C C C C C C H H H H H H H H H H H H H H H H H
charge: -0.008456 -0.575121 -0.575118 -0.515272 -0.515262 0.441902 0.441904 0.158762 0.158726 0.469942 -0.379111 -0.364625 -0.379117 -0.364625 -0.493493 -0.493801 -0.815966 0.210062 0.219490 0.219490 0.210064 0.230481 0.206692 0.206694 0.230481 0.226014 0.223348 0.226021 0.223349 0.240185 0.240195 0.229817 0.236499 0.229850
chargesum: 0.00000
title: Mulliken charges with hydrogens summed into heavy atoms:
elementType: N C C C C C C C C C C C C C C C C
charge: -0.008456 -0.145569 -0.145563 -0.078099 -0.078087 0.441902 0.441904 0.158762 0.158726 0.469942 -0.153097 -0.141277 -0.153096 -0.141277 -0.253309 -0.253606 -0.119800
polarizability: 1.72772318e+02 -6.06538327e-03 1.95288009e+02 2.48456647e+01 -1.33803334e-03 1.25487313e+02
1716.lowfreq: -51.1085 -0.0003 0.0002 0.0005 2.9034 9.6282 17.9854 62.7718 109.3228
frequency: -51.0565 62.7690 109.3011 138.7857 148.9713 196.1232 240.8562 246.9088 274.6140 291.2065 308.6871 338.4414 353.3564 423.6092 439.7887 449.8492 484.3601 509.0925 527.6262 538.2198 562.1423 622.9126 627.1261 658.9642 708.6523 733.1591 758.0378 790.4810 799.3382 809.9553 834.7742 858.5115 887.9960 890.5647 898.7842 909.7193 922.4128 939.6676 952.8289 968.3178 969.5550 991.4631 1004.2683 1007.5556 1017.8450 1044.3416 1101.2939 1125.2074 1144.2134 1146.5177 1165.6550 1165.9723 1184.1446 1205.9273 1206.1619 1212.9703 1272.7963 1277.5719 1295.8477 1309.5159 1313.8477 1317.4195 1341.6189 1379.0208 1396.8448 1405.9446 1408.2838 1413.4894 1447.5133 1449.3336 1466.4812 1469.5632 1469.6309 1472.9819 1496.3277 1550.3457 1575.8024 1592.3320 1609.1890 2977.2432 2987.1641 2987.5229 3002.9697 3003.8122 3047.3707 3047.5606 3059.9375 3076.2475 3076.7170 3090.3501 3106.0514 3108.0221 3121.0798 3123.6667 3129.1448 3136.8030
redmass: 1.0118 4.2237 2.9856 3.4079 4.6549 4.1919 3.3397 3.7041 2.4906 2.7463 2.1010 2.2384 4.8016 2.7511 2.3902 4.2146 4.8378 5.4570 4.3633 3.6319 2.8993 2.5979 6.2811 4.1499 2.5761 4.0413 2.3943 2.0868 1.9619 1.4335 2.3702 1.6323 1.8711 2.8479 2.5437 1.8656 3.4983 1.4973 1.4138 5.5834 1.7747 2.0480 2.0878 2.5695 2.0122 1.5821 1.3823 1.1665 1.1488 1.6276 1.2503 1.2456 1.1091 3.0036 1.7074 1.6948 1.4231 1.2498 2.1041 1.5989 1.7875 1.4754 2.7113 6.9783 1.2302 2.5404 3.0579 3.0555 1.1040 1.1106 1.1447 1.1129 1.1289 1.0598 2.6973 5.9320 6.5758 5.6474 6.4006 1.0390 1.0587 1.0588 1.0604 1.0604 1.1040 1.1039 1.0945 1.1032 1.1032 1.1001 1.0863 1.0865 1.0917 1.0929 1.0962 1.0973
irintensity: 0.3808 1.3060 0.0750 0.5314 0.0007 0.1714 0.0611 0.0977 0.7701 2.9703 0.3716 0.0764 7.0598 0.2676 0.9432 0.4429 0.3752 3.1013 1.6638 5.0284 31.9603 1.7294 0.1313 1.7969 1.4064 19.2843 0.7648 10.7582 14.9865 24.6936 2.4726 6.3308 0.0320 3.8019 38.3869 3.9482 5.6006 6.3067 0.2732 0.7584 2.1682 1.3528 2.5265 0.4717 1.1157 11.8624 8.1827 0.0152 2.6611 0.0354 0.5073 16.5323 0.8409 1.8119 7.4084 1.4406 0.0283 0.6709 0.8156 0.0726 0.1596 3.1622 5.0346 0.1929 16.3761 3.2611 4.0521 8.2715 2.1028 15.5735 11.6319 3.0165 35.5460 12.0952 7.7362 34.1262 0.0100 82.9564 7.1360 28.1208 53.5542 27.8453 118.2877 18.3995 12.5156 24.9214 21.7329 6.8044 33.8410 14.3352 0.7915 19.9723 22.8527 5.7204 43.8389 0.5777
temp: 298.150 k
press: 1.00000 atm
elementType: 7 6 6 6 6 6 6 6 6 6 6 6 6 6 6 6 6 1 1 1 1 1 1 1 1 1 1 1 1 1 1 1 1 1
symmnumber: 1
zpe: 746011.4 jmol-1
zpe.correction: 0.284141 hartree
zpe.thermalcorrener: 0.297321 hartree
zpe.thermalcorrenthalpy: 0.298266 hartree
zpe.thermalcorrgfe: 0.245615 hartree
zpe.sumelectzpe: -673.421807 hartree
zpe.sumelectthermal: -673.408626 hartree
zpe.sumelectthermalent: -673.407682 hartree
zpe.sumelectthermalfe: -673.460332 hartree
dipole: 2.4729 -0.0004 0.4046
dipole: 2.5058
quadrupole: -97.3301 -89.7104 -103.9993
quadrupole: -0.0021 9.0420 -0.0001
quadrupole: -0.3169 7.3029 -6.9860 -0.0021 9.0420 -0.0001
hfenergy: -673.7059477 hartree
pointgroup: C01[X(C16H17N1)]
dipole: -0.9492083 0.0000429 -0.2663188 debye
polarizability: 166.700346|0.0122565|195.2880056|29.4542278|-0.0052441|131.5592885 unknown
InChI: InChI=1S/C16H17N/c1-12-10-15-8-6-13-2-3-14(5-4-13)7-9-16(11-12)17-15/h2-5,10-11H,6-9H2,1H3
charge 0 multiplicity 1
34 atoms
N  -0.351051 0.000066 1.226784
C  1.056108 -2.739315 -0.026903
C  1.057321 2.73875 -0.027031
C  -0.052656 -2.433911 1.076263
C  -0.051576 2.433897 1.07615
C  1.679249 -1.419443 -0.455944
C  1.679875 1.418579 -0.456005
C  -0.870948 -1.18152 0.765179
C  -0.870419 1.181847 0.765138
C  -2.659072 0.00054 -0.431584
C  1.095653 -0.705914 -1.534889
C  2.535785 -0.70677 0.420535
C  1.095967 0.705261 -1.534921
C  2.536095 0.705569 0.420505
C  -2.035243 -1.212565 -0.041974
C  -2.034733 1.21337 -0.04201
C  -3.910117 0.000743 -1.290631
H  0.579801 -3.243337 -0.889022
H  1.788203 -3.442237 0.414131
H  1.789728 3.441366 0.413972
H  0.58124 3.242946 -0.889172
H  0.461035 -2.266609 2.039219
H  -0.705274 -3.321501 1.175764
H  -0.703805 3.321779 1.1756
H  0.462037 2.266426 2.039118
H  0.502728 -1.246177 -2.283372
H  3.064564 -1.24313 1.218389
H  0.503287 1.245754 -2.283432
H  3.065115 1.241729 1.218334
H  -2.447947 -2.174297 -0.369627
H  -2.447027 2.17527 -0.369675
H  -4.527883 0.896661 -1.1053
H  -3.649868 -0.001937 -2.367184
H  -4.530674 -0.892488 -1.101605
