program: Gaussian 09
title: 000144421
version: EM64L-G09RevD.01
frameworkgroup: C1[X(C14H21N3O5)]
method: RPBEPBE
basis: SDD
operation: Freq
keyword: #p
keyword: freq=noraman
keyword: PBEPBE/SDD
title: #p freq=noraman PBEPBE/SDD
converged: YES YES NO NO
title: Mulliken charges:
elementType: O O O O O N N N C C C C C C C C C C C C C C H H H H H H H H H H H H H H H H H H H H H
charge: -0.230123 -0.224210 -0.226581 -0.202775 -0.268632 -0.194753 -0.166282 -0.289996 -0.108901 -0.431455 -0.510953 -0.512440 0.215518 0.175583 -0.354647 -0.512136 -0.508918 0.201715 0.191661 -0.411324 -0.259827 -0.498944 0.299181 0.274516 0.274641 0.301140 0.282322 0.258320 0.260063 0.265107 0.215243 0.182880 0.264506 0.266343 0.274003 0.262517 0.211453 0.236752 0.184893 0.181001 0.200346 0.234470 0.198721
chargesum: 0.00000
title: Mulliken charges with hydrogens summed into heavy atoms:
elementType: O O O O O N N N C C C C C C C C C C C C C C
charge: -0.230123 -0.224210 -0.226581 -0.202775 -0.268632 -0.194753 -0.166282 0.011144 0.190281 0.117702 0.029689 0.012730 0.215518 0.175583 0.043476 0.018714 0.027602 0.201715 0.191661 0.036881 0.106067 0.134593
polarizability: 2.05803670e+02 -6.23640485e+00 1.80993045e+02 -1.55423389e+01 -1.01153356e+01 1.52896070e+02
1716.lowfreq: -8.4811 -2.9901 0.0002 0.0004 0.0007 0.3866 16.6202 27.4439 35.1268
frequency: 15.4259 27.2748 35.0991 39.4053 40.2229 55.9017 62.1246 79.4455 88.2559 93.3865 98.8151 111.2543 112.9842 129.6387 137.0094 152.3258 218.9166 228.2140 237.6136 250.0837 287.3700 317.7267 355.1458 377.0202 416.8133 440.2325 479.2399 524.6417 534.7337 541.6116 542.4239 548.2826 575.3519 588.2965 597.5325 634.5925 653.5032 657.3028 671.2623 712.8655 732.0631 779.2029 821.8900 825.7505 878.6118 887.2253 896.3200 950.6341 989.1421 1008.7528 1009.7127 1013.2249 1017.7172 1026.4109 1041.5695 1057.8076 1069.1175 1079.0997 1091.3789 1100.2689 1112.2914 1139.0360 1144.2568 1145.9792 1157.2206 1163.9362 1174.5519 1183.6854 1206.7142 1209.6974 1225.1749 1241.5623 1254.3578 1266.2199 1272.0991 1283.8956 1291.7413 1293.1647 1301.4818 1315.2478 1321.2211 1352.9438 1364.5136 1366.8100 1385.2960 1396.6717 1433.7788 1436.0475 1438.3789 1446.0221 1449.5825 1452.4318 1458.3633 1466.9768 1475.0207 1486.8132 1491.4043 1498.6461 1615.1441 1627.8263 1681.2529 1695.5294 2875.3359 2901.4759 2922.6805 2947.1339 2992.9446 2997.1476 3008.8832 3026.0594 3027.1078 3034.4875 3035.9769 3036.3478 3043.4515 3073.8793 3081.3479 3085.1187 3098.5774 3101.5047 3102.6872 3113.2425 3449.7761
redmass: 4.8093 5.7428 3.4659 2.1340 5.5840 4.8889 3.5120 2.0227 3.3282 2.5448 3.3424 6.0768 2.1804 3.5066 5.1626 6.7404 5.3434 1.1939 5.1684 4.3791 3.2314 4.7121 6.1665 4.4281 5.2574 4.1610 3.4049 3.2473 3.7819 3.7405 3.5966 3.6774 2.8780 3.6266 5.8296 4.1265 5.2340 5.8883 4.3888 1.6330 3.8182 1.0814 1.5754 1.5513 1.3641 3.5129 2.5851 5.3544 3.9927 2.3572 2.3622 2.2643 2.4759 3.5122 4.5300 3.4349 4.7259 3.5986 2.7172 2.5445 1.3832 1.9509 1.2557 1.2262 2.0033 1.7763 1.9986 2.7251 1.1890 1.1205 2.4680 1.8904 1.6670 1.2703 1.2040 1.1620 1.5152 1.5193 2.2901 1.7302 1.4237 2.7811 1.5226 1.5429 1.3918 1.4672 1.0801 1.0754 1.1623 1.0925 1.0922 1.1004 1.0513 1.0629 1.0728 1.0896 1.1855 1.1144 10.6457 11.4982 11.7189 11.4748 1.0699 1.0533 1.0357 1.1056 1.1026 1.0706 1.0793 1.0605 1.0595 1.0742 1.0638 1.0637 1.0707 1.1021 1.1026 1.1014 1.1016 1.1016 1.0968 1.1060 1.0741
irintensity: 0.7245 0.4403 1.9349 5.3012 1.4917 0.3752 0.1188 0.3716 10.1976 5.0261 1.8384 2.7456 4.9099 5.9757 0.6251 7.4297 1.9941 3.8834 1.7249 2.9599 10.4554 4.1806 18.0087 33.0539 9.7457 1.9720 12.1662 3.4223 0.3193 0.6473 0.4021 0.8511 5.4009 4.4259 14.5459 9.4100 19.0202 30.1216 33.7739 185.3975 9.7023 3.8682 23.5205 22.1670 3.4000 21.5774 47.0423 2.2688 2.4348 7.0448 16.3367 6.9498 2.4117 19.8871 42.5128 40.6393 4.7999 86.0210 9.2186 17.6362 7.5145 96.6836 5.3307 0.8871 128.1379 58.4996 104.2346 43.2270 6.6932 0.3441 56.6842 74.0028 30.1410 0.4616 1.1088 4.7192 1.3693 3.1785 73.8628 119.1768 30.5795 137.0274 45.1406 57.6565 47.1790 5.2823 4.5939 1.5954 0.9226 39.8353 37.1006 24.2826 12.2671 14.7155 4.0081 23.9135 45.5157 5.0411 328.6235 653.3886 36.8019 20.8238 63.0984 61.7875 106.3202 62.3629 74.9662 6.7158 38.2890 10.9695 12.0828 4.6084 2.4117 1.8324 4.4922 38.9612 0.4208 1.7050 7.6497 8.2788 33.1478 0.1528 10.6982
temp: 298.150 k
press: 1.00000 atm
elementType: 8 8 8 8 8 7 7 7 6 6 6 6 6 6 6 6 6 6 6 6 6 6 1 1 1 1 1 1 1 1 1 1 1 1 1 1 1 1 1 1 1 1 1
symmnumber: 1
zpe: 912890.7 jmol-1
zpe.correction: 0.347702 hartree
zpe.thermalcorrener: 0.370832 hartree
zpe.thermalcorrenthalpy: 0.371776 hartree
zpe.thermalcorrgfe: 0.290895 hartree
zpe.sumelectzpe: -1084.809950 hartree
zpe.sumelectthermal: -1084.786820 hartree
zpe.sumelectthermalent: -1084.785876 hartree
zpe.sumelectthermalfe: -1084.866757 hartree
dipole: -1.5589 2.4336 2.8158
dipole: 4.0351
quadrupole: -105.6087 -133.8613 -139.8770
quadrupole: 5.3468 9.5216 9.5342
quadrupole: 20.8403 -7.4123 -13.4280 5.3468 9.5216 9.5342
hfenergy: -1085.1576518 hartree
pointgroup: C01 [X(C14H21N3O5)]
dipole: 0.5123345 1.0767793 -1.0479807 debye
polarizability: 203.9022618|9.4459942|180.7144133|-16.8871318|10.610367|155.0761097 unknown
InChI: InChI=1S/C14H21N3O5/c1-22-8-2-7-15-10(17-13(20)5-6-14(17)21)9-16-11(18)3-4-12(16)19/h10,15H,2-9H2,1H3
charge 0 multiplicity 1
43 atoms
O  -0.487002 1.936409 1.959834
O  1.21831 0.770928 -2.246129
O  3.082995 1.201317 1.215741
O  2.130439 -3.036072 -0.547271
O  -6.245752 -1.100983 0.384904
N  0.242778 1.069966 -0.114382
N  2.342777 -0.926436 0.491404
N  -1.39316 -0.60573 0.731083
C  -0.077165 -0.387964 0.18089
C  1.018814 -0.94193 1.131359
C  0.609033 3.397892 0.248504
C  1.037936 3.039535 -1.19403
C  0.047684 2.101308 0.833967
C  0.868579 1.519164 -1.298215
C  -2.540206 -0.445694 -0.188112
C  4.503312 -0.249244 -0.246488
C  4.162447 -1.61289 -0.892343
C  3.269007 0.136529 0.574654
C  2.78872 -1.992153 -0.337934
C  -3.84698 -0.863844 0.513498
C  -5.069263 -0.709875 -0.396951
C  -7.481364 -1.004337 -0.387772
H  0.007013 -0.896378 -0.797262
H  0.760383 -1.988372 1.361029
H  1.065428 -0.347629 2.059859
H  -1.527129 -0.118263 1.627591
H  1.46701 3.697607 0.874984
H  -0.146606 4.198176 0.30897
H  0.407852 3.521336 -1.962751
H  2.084828 3.302298 -1.417782
H  -2.363095 -1.090233 -1.071613
H  -2.641924 0.601922 -0.564957
H  5.37826 -0.294603 0.425183
H  4.702202 0.54402 -0.986426
H  4.088116 -1.555787 -1.992009
H  4.88635 -2.409894 -0.653748
H  -4.005968 -0.244914 1.418245
H  -3.766578 -1.91402 0.846005
H  -4.975424 -1.359465 -1.297961
H  -5.175543 0.344483 -0.744048
H  -7.462408 -1.673554 -1.275156
H  -8.294127 -1.316585 0.286656
H  -7.668577 0.036063 -0.73202
