program: Gaussian 09
title: 000144408
version: EM64L-G09RevD.01
frameworkgroup: C1[X(C10H20O2)]
method: RPBEPBE
basis: SDD
operation: Freq
keyword: #pfreq=noraman
keyword: PBEPBE/SDD
title: #p freq=noraman PBEPBE/SDD
converged: YES YES NO NO
title: Mulliken charges:
elementType: O O C C C C C C C C C C H H H H H H H H H H H H H H H H H H H H
charge: -0.455083 -0.469082 -0.013997 -0.475935 -0.450823 -0.143233 -0.400852 -0.406558 -0.383508 -0.128975 -0.371897 -0.702931 0.230854 0.194175 0.201012 0.250214 0.177220 0.185299 0.196295 0.193549 0.193403 0.198175 0.199104 0.186368 0.207287 0.226502 0.207871 0.353015 0.343458 0.214497 0.247641 0.196933
chargesum: 0.00000
title: Mulliken charges with hydrogens summed into heavy atoms:
elementType: O O C C C C C C C C C C
charge: -0.102068 -0.125623 0.216857 -0.080748 -0.023388 0.042066 -0.011007 -0.014980 0.001964 0.078312 0.062477 -0.043860
polarizability: 1.30435868e+02 2.35147946e-01 1.07593659e+02 -1.00240941e+00 1.08148594e-01 9.78761999e+01
1716.lowfreq: -32.4030 -9.2369 -0.0006 -0.0006 -0.0003 16.0555 53.3192 64.6935 88.1077
frequency: 53.1563 64.5615 87.7106 125.2939 128.9646 191.1098 216.9602 223.6493 257.3387 286.2458 295.5592 308.6100 311.7569 373.9329 427.0616 430.4939 462.3731 479.5867 561.6626 569.4851 685.7993 759.9616 782.5839 792.2570 823.0012 842.6986 882.8063 892.4684 907.8317 914.7492 934.4598 968.2749 1037.4648 1047.9836 1055.3359 1064.6101 1072.8008 1076.8571 1090.5942 1097.2757 1113.7934 1135.7401 1184.6060 1202.2830 1223.4374 1248.6175 1255.9611 1259.0497 1274.2717 1281.7641 1296.3668 1303.2253 1311.4062 1327.3283 1330.6243 1333.6058 1339.7827 1343.3552 1354.0801 1384.8125 1391.0019 1401.4298 1455.8679 1461.7292 1463.2086 1463.9454 1470.1764 1474.6401 1477.7679 1490.1558 2867.5042 2948.1919 2951.6366 2963.4171 2964.4098 2965.0012 2973.9062 2978.4588 2980.1913 2994.8559 3014.6110 3024.4614 3026.0871 3037.4315 3047.5096 3060.0384 3071.2238 3098.7378 3472.5918 3557.4844
redmass: 2.9342 3.2446 2.1473 3.5752 3.0843 3.4437 1.5370 1.3450 3.6896 3.6839 1.5500 1.8395 2.1362 2.6877 2.9909 2.2001 2.6951 2.3389 1.4059 1.4642 3.7743 1.6707 1.4756 2.1757 2.2331 1.9075 1.9790 1.5395 2.5982 1.9543 1.9408 2.3823 3.1149 1.8128 1.2994 1.5436 1.8649 1.4762 1.8473 2.1292 2.3402 2.0594 1.4391 1.4345 1.3694 1.2877 1.3059 1.2435 1.2565 1.1708 1.2063 1.2252 1.2274 1.3822 1.3965 1.4510 1.4541 1.4929 1.4459 1.4000 1.5245 1.5001 1.0826 1.0871 1.0882 1.0842 1.0814 1.0451 1.0950 1.0566 1.0815 1.0627 1.0688 1.0610 1.0625 1.0663 1.0823 1.0566 1.0619 1.0610 1.0971 1.0955 1.1005 1.1028 1.0989 1.0945 1.0992 1.0995 1.0644 1.0661
irintensity: 0.1273 1.4491 0.6735 6.3979 1.4062 1.2582 0.4690 0.5373 10.1733 2.9777 62.6379 11.2241 13.1913 7.7051 0.6788 5.6863 9.1938 10.2095 93.7633 90.1434 15.1987 2.7842 0.0129 1.4668 13.7526 6.0372 10.5772 14.3994 52.3936 7.0024 25.8442 29.0284 19.4727 1.1716 0.5831 8.4732 30.7114 10.5723 1.8476 10.2787 0.3288 15.7665 3.6723 14.5152 10.0575 3.1439 8.6774 10.1860 2.1796 28.1405 15.4932 1.1252 13.0339 5.2703 0.2309 0.8979 1.0995 0.7677 3.7311 10.3979 5.1641 25.4211 7.7174 5.9391 6.7434 3.1430 19.1130 10.7337 3.3499 12.8690 65.1273 25.4108 24.1773 35.6293 35.3594 28.6392 10.6588 45.4179 62.6546 25.1585 76.1139 74.9636 32.0011 107.4940 9.2751 30.9207 59.9239 29.6934 19.3008 6.5357
temp: 298.150 k
press: 1.00000 atm
elementType: 8 8 6 6 6 6 6 6 6 6 6 6 1 1 1 1 1 1 1 1 1 1 1 1 1 1 1 1 1 1 1 1
symmnumber: 1
zpe: 751476.8 jmol-1
zpe.correction: 0.286222 hartree
zpe.thermalcorrener: 0.299720 hartree
zpe.thermalcorrenthalpy: 0.300664 hartree
zpe.thermalcorrgfe: 0.246708 hartree
zpe.sumelectzpe: -542.503529 hartree
zpe.sumelectthermal: -542.490031 hartree
zpe.sumelectthermalent: -542.489087 hartree
zpe.sumelectthermalfe: -542.543043 hartree
dipole: 0.2208 1.3510 2.1109
dipole: 2.5160
quadrupole: -78.5588 -78.4011 -71.6843
quadrupole: 0.8875 -3.1290 -3.8662
quadrupole: -2.3441 -2.1864 4.5305 0.8875 -3.1290 -3.8662
hfenergy: -542.789751 hartree
pointgroup: C01 [X(C10H20O2)]
dipole: 0.0863752 0.5634512 0.8092416 debye
polarizability: 130.4406004|0.1484704|107.5865134|-0.9446197|-0.2697932|97.8786132 unknown
InChI: InChI=1S/C10H20O2/c1-2-9(11)10(12)8-6-4-3-5-7-8/h8-12H,2-7H2,1H3
charge 0 multiplicity 1
32 atoms
O  -0.969643 -2.0132 -0.471145
O  -3.045687 -0.81163 0.868882
C  0.650781 -0.226819 -0.136749
C  1.059909 1.033696 0.670637
C  1.802402 -1.266448 -0.134788
C  -0.645033 -0.870634 0.396933
C  2.386986 1.639105 0.15047
C  3.121641 -0.662197 -0.666151
C  3.528177 0.59448 0.138866
C  -1.89013 0.055914 0.479904
C  -2.287981 0.725437 -0.842901
C  -3.549522 1.603393 -0.716092
H  0.466915 0.069855 -1.190707
H  1.179536 0.756843 1.740283
H  0.264453 1.803881 0.625275
H  1.498494 -2.142978 -0.733501
H  1.958666 -1.625165 0.905875
H  -0.448569 -1.244272 1.434127
H  2.670994 2.512224 0.770138
H  2.231922 2.016902 -0.88168
H  2.995443 -0.387578 -1.73421
H  3.928146 -1.420066 -0.62579
H  4.450004 1.042359 -0.280983
H  3.761681 0.297578 1.182804
H  -1.734469 0.825197 1.265148
H  -2.441185 -0.063638 -1.603053
H  -1.437288 1.342226 -1.191543
H  -1.914564 -2.248788 -0.258932
H  -2.962787 -1.04785 1.828044
H  -3.820673 2.046125 -1.691838
H  -4.402202 1.003152 -0.357025
H  -3.391016 2.434195 -0.001598
