program: Gaussian 09
title: 000144404
version: EM64L-G09RevD.01
frameworkgroup: C1[X(C13H16N2O3)]
method: RPBEPBE
basis: SDD
operation: Freq
keyword: #p
keyword: freq=noraman
keyword: PBEPBE/SDD
title: #p freq=noraman PBEPBE/SDD
converged: YES YES NO NO
title: Mulliken charges:
elementType: O O O N N C C C C C C C C C C C C C H H H H H H H H H H H H H H H H
charge: -0.216552 -0.224668 -0.315524 -0.160075 -0.364026 -0.506839 -0.506376 -0.456375 0.194199 0.201889 0.282687 0.219215 -0.340551 -0.331649 -0.262509 -0.265340 -0.233522 -0.687737 0.263388 0.265401 0.267945 0.263848 0.267979 0.257290 0.341483 0.271821 0.239917 0.223557 0.221332 0.208773 0.208536 0.208789 0.233169 0.230523
chargesum: 0.00000
title: Mulliken charges with hydrogens summed into heavy atoms:
elementType: O O O N N C C C C C C C C C C C C C
charge: -0.216552 -0.224668 -0.315524 -0.160075 -0.022543 0.021950 0.025417 0.068894 0.194199 0.201889 0.282687 0.219215 -0.068730 -0.091732 -0.038952 -0.044008 0.183787 -0.015256
polarizability: 1.85382962e+02 5.44491961e+00 1.91483682e+02 8.56202384e+00 -7.18882781e+00 1.10693019e+02
1716.lowfreq: -7.7364 -3.1227 -0.0009 -0.0008 -0.0003 2.3170 25.9551 26.6963 52.1279
frequency: 25.8654 26.6632 52.1215 71.4982 90.5668 97.7456 104.1427 111.9019 139.5525 179.0542 200.7411 242.3296 266.5116 286.9242 315.9041 329.8895 364.5291 440.4611 461.5395 508.6177 538.4706 542.7579 560.2568 560.8791 563.9659 591.4228 604.6497 628.0241 654.1261 716.1351 728.3895 741.7259 749.0110 796.0659 822.6384 825.3873 845.7259 907.7870 910.9031 926.4081 960.5681 989.6293 1010.4948 1026.2750 1039.7846 1042.4479 1072.0554 1088.6498 1117.4095 1138.9306 1141.2450 1143.6494 1174.3120 1191.8763 1201.5907 1207.2925 1234.7427 1260.0044 1269.7287 1289.1157 1295.3897 1328.3080 1338.3850 1367.8419 1396.5437 1398.2456 1404.9933 1439.2761 1441.7892 1454.4191 1461.6131 1461.9966 1469.5047 1480.9112 1493.0709 1522.6118 1600.0430 1614.1349 1628.4137 1692.3892 2954.8703 2996.0582 3011.9417 3026.8452 3031.0511 3036.4275 3079.6481 3093.6272 3095.7330 3097.2615 3103.9577 3129.8348 3141.1685 3153.3412 3168.9154 3556.1299
redmass: 5.5747 4.4775 4.6984 4.1566 1.9747 2.2371 4.2448 3.8060 4.9083 5.0203 5.4485 1.1964 5.2183 3.5718 3.7507 3.2615 4.7718 4.2805 3.7725 4.5432 3.9579 3.2567 3.6285 3.0301 2.6765 6.0829 1.4487 5.3642 5.9484 4.7349 4.1972 1.2790 4.0000 4.1578 1.1421 1.5510 1.3278 2.5524 1.5190 2.8090 1.2904 4.6383 2.2022 3.1338 2.8550 2.5684 2.4797 3.3421 2.2076 1.4437 1.2269 2.4626 1.1193 3.4125 2.2179 1.1135 2.2620 1.1398 1.9354 1.5090 1.8983 1.8424 1.4605 1.3492 1.4851 1.3644 2.8860 1.0782 2.1304 1.0940 1.1984 1.0404 1.5933 1.0962 1.1113 2.7448 5.5837 6.8233 10.1454 11.4685 1.0554 1.0361 1.1074 1.0594 1.0590 1.0635 1.1032 1.0989 1.1063 1.1016 1.1014 1.0851 1.0899 1.0939 1.0999 1.0766
irintensity: 0.3010 1.2594 0.9932 0.8385 0.2114 4.7626 0.4150 12.0857 2.6487 2.2235 0.1337 0.5582 2.9145 1.7387 0.7029 15.7320 26.3004 9.0063 1.6638 7.8888 0.2250 3.3584 17.5407 9.5502 14.1693 6.9902 97.0355 15.1383 31.6796 18.5716 12.7071 115.5458 13.8849 2.0379 2.2272 19.7005 4.5787 26.6503 14.0082 9.5946 1.6775 2.6979 0.2035 23.4263 66.3421 17.4107 17.2309 59.7356 7.4991 5.3152 0.6937 105.6199 12.4779 322.6127 92.7452 0.3892 172.9980 0.0354 77.0249 2.0705 181.1392 61.7571 14.9750 13.1563 34.0515 38.7861 8.3634 0.8705 41.8866 27.0146 35.4032 11.4942 43.4027 0.8389 10.4218 195.3004 6.1005 140.5491 500.4815 25.7351 44.8038 22.8477 35.3742 12.3042 26.5648 2.4467 0.0207 30.5028 2.2560 8.5716 34.7807 0.8990 9.1885 20.5667 21.5169 55.1887
temp: 298.150 k
press: 1.00000 atm
elementType: 8 8 8 7 7 6 6 6 6 6 6 6 6 6 6 6 6 6 1 1 1 1 1 1 1 1 1 1 1 1 1 1 1 1
symmnumber: 1
zpe: 718344.3 jmol-1
zpe.correction: 0.273603 hartree
zpe.thermalcorrener: 0.290824 hartree
zpe.thermalcorrenthalpy: 0.291768 hartree
zpe.thermalcorrgfe: 0.226695 hartree
zpe.sumelectzpe: -838.847610 hartree
zpe.sumelectthermal: -838.830389 hartree
zpe.sumelectthermalent: -838.829445 hartree
zpe.sumelectthermalfe: -838.894518 hartree
dipole: 0.0671 -1.6614 -1.7678
dipole: 2.4269
quadrupole: -82.2194 -116.5909 -102.5089
quadrupole: -0.3602 -2.1640 -2.5072
quadrupole: 18.2204 -16.1512 -2.0692 -0.3602 -2.1640 -2.5072
hfenergy: -839.1212133 hartree
pointgroup: C01 [X(C13H16N2O3)]
dipole: -0.3009148 -0.7832047 0.455787 debye
polarizability: 181.2599119|-6.3899459|183.9647025|12.7019515|27.6286378|122.3350485 unknown
InChI: InChI=1S/C13H16N2O3/c1-2-18-11-6-4-3-5-10(11)14-9-15-12(16)7-8-13(15)17/h3-6,14H,2,7-9H2,1H3
charge 0 multiplicity 1
34 atoms
O  -2.827292 -1.740742 -0.791005
O  -2.224501 2.807829 0.155543
O  1.946699 -1.81602 -0.705361
N  -2.292732 0.538864 -0.508248
N  -0.029025 -0.144098 -1.21886
C  -3.968174 -0.335447 0.946353
C  -3.770949 1.169542 1.251774
C  -1.223747 0.575616 -1.560883
C  -2.997545 -0.647674 -0.199351
C  -2.690064 1.648665 0.273938
C  0.991625 0.341936 -0.384877
C  2.084208 -0.542903 -0.107481
C  1.016346 1.641724 0.178836
C  3.167132 -0.133663 0.692195
C  2.110602 2.053072 0.977341
C  3.183589 1.176217 1.235809
C  3.012318 -2.805306 -0.471023
C  2.617119 -4.076667 -1.217841
H  -4.994203 -0.586108 0.627515
H  -3.727942 -0.986925 1.803999
H  -3.426704 1.363105 2.282073
H  -4.684244 1.769466 1.098904
H  -1.661263 0.125651 -2.467312
H  -1.022232 1.64603 -1.739579
H  0.021014 -1.137197 -1.451333
H  0.183438 2.332851 0.01139
H  3.997751 -0.816143 0.896554
H  2.110873 3.063281 1.400694
H  4.02718 1.495726 1.856378
H  3.975038 -2.400084 -0.845246
H  3.106959 -2.9901 0.618968
H  3.386924 -4.856158 -1.071835
H  1.652911 -4.464185 -0.846579
H  2.52049 -3.880154 -2.299351
