program: Gaussian 09
title: 000144396
version: EM64L-G09RevD.01
frameworkgroup: C1[X(C11H14ClNO)]
method: RPBEPBE
basis: SDD
operation: Freq
keyword: #p
keyword: freq=noraman
keyword: PBEPBE/SDD
title: #p freq=noraman PBEPBE/SDD
converged: YES YES NO NO
title: Mulliken charges:
elementType: Cl O N C C C C C C C C C C C H H H H H H H H H H H H H H
charge: -0.071432 -0.244206 -0.475475 -0.208158 0.224076 0.440215 -0.684702 -0.684431 0.369195 -0.300604 -0.401358 -0.815671 -0.249918 -0.227423 0.203343 0.215387 0.217623 0.243585 0.214955 0.220819 0.245635 0.306056 0.236819 0.293933 0.221958 0.218503 0.257254 0.234020
chargesum: 0.00000
title: Mulliken charges with hydrogens summed into heavy atoms:
elementType: Cl O N C C C C C C C C C C C
charge: -0.071432 -0.244206 -0.169419 -0.004815 0.224076 0.440215 -0.008108 -0.003022 0.369195 -0.300604 -0.164539 -0.081276 0.007336 0.006598
polarizability: 1.79821406e+02 -4.50938538e+00 1.51624636e+02 6.86215609e+00 -3.00377230e+00 8.39101450e+01
1716.lowfreq: -22.6437 0.0019 0.0022 0.0026 6.8163 7.5576 11.9656 52.7955 68.9708
frequency: -20.4058 52.6601 68.9380 89.1021 144.1348 184.1337 200.6327 211.7581 221.3011 232.1150 242.6072 264.8606 294.2118 304.9995 334.9182 371.9782 415.7980 464.3603 510.2785 522.1308 543.7055 605.4436 632.7003 668.4477 711.4576 729.3776 771.7313 801.8138 835.2306 883.4830 894.0991 923.7256 931.1065 962.9686 969.1174 994.7684 1052.4322 1081.8925 1094.2830 1105.6563 1131.5851 1152.1293 1182.2361 1188.1968 1237.5399 1278.2893 1290.5451 1343.4923 1365.9850 1376.7915 1396.2621 1397.6723 1415.5277 1450.4980 1463.6196 1465.1533 1471.1938 1473.1877 1479.6810 1487.7253 1491.6238 1572.0313 1607.3661 1633.5902 2974.3278 2981.5010 2983.1990 2986.4664 3064.7525 3078.1346 3082.7352 3091.4448 3091.6192 3097.8593 3134.9491 3156.5430 3178.9082 3500.9457
redmass: 3.0923 3.8522 4.5019 8.2030 4.0882 1.2818 3.5865 1.1582 2.5669 2.1732 1.7842 2.0818 3.1858 4.6613 3.4162 6.0536 3.3692 3.7006 3.9725 4.1251 3.4870 1.4473 4.5383 2.9185 4.4834 5.7967 1.2799 5.5725 4.6257 3.3827 1.4003 1.1712 2.8950 1.4696 1.3346 1.6349 1.5326 1.8466 1.5303 2.4996 2.9166 1.9883 1.4950 1.8326 2.1950 2.0535 1.3630 1.7833 4.9629 1.1925 1.2156 1.2260 2.1691 1.1936 1.0483 2.7546 1.2286 1.1982 1.0587 1.3532 1.0670 5.8805 6.9566 5.3244 1.0804 1.0363 1.0355 1.0382 1.0968 1.1007 1.1000 1.1002 1.1008 1.1000 1.0876 1.0929 1.0981 1.0758
irintensity: 0.4185 2.5818 1.2801 2.1735 2.0667 0.5288 0.8486 1.3835 2.8526 2.0732 6.1214 0.0760 8.5434 5.3030 1.3082 10.4626 1.4687 1.0735 0.9702 1.3891 7.1290 54.8219 12.7359 23.2850 2.9117 15.4997 61.4072 17.7470 10.9049 16.7048 1.4200 5.7818 24.9808 0.2181 0.5043 9.8438 8.0029 6.9221 11.4532 0.3905 35.9117 65.6268 7.5730 28.2553 13.6559 34.1193 0.7661 12.3521 55.0964 15.9164 34.8647 19.1492 42.3024 65.5369 4.0559 79.8287 45.9154 45.1502 9.9157 159.1926 36.7497 13.5728 10.7499 88.1566 34.2534 16.8230 38.8074 23.7930 10.3739 22.2319 54.3200 17.5280 5.5248 35.8775 6.4978 14.8808 8.3190 24.4150
temp: 298.150 k
press: 1.00000 atm
elementType: 17 8 7 6 6 6 6 6 6 6 6 6 6 6 1 1 1 1 1 1 1 1 1 1 1 1 1 1
symmnumber: 1
zpe: 592628.0 jmol-1
zpe.correction: 0.225720 hartree
zpe.thermalcorrener: 0.239526 hartree
zpe.thermalcorrenthalpy: 0.240470 hartree
zpe.thermalcorrgfe: 0.185406 hartree
zpe.sumelectzpe: -1016.579847 hartree
zpe.sumelectthermal: -1016.566041 hartree
zpe.sumelectthermalent: -1016.565097 hartree
zpe.sumelectthermalfe: -1016.620161 hartree
dipole: 0.3057 0.1891 -2.3696
dipole: 2.3967
quadrupole: -78.8119 -89.0887 -95.2881
quadrupole: -6.3211 5.6571 1.6722
quadrupole: 8.9177 -1.3591 -7.5586 -6.3211 5.6571 1.6722
hfenergy: -1016.8055669 hartree
pointgroup: C01 [X(C11H14Cl1N1O1)]
dipole: 0.16133 0.0050344 -0.9290124 debye
polarizability: 179.3673565|1.2165453|149.9877969|12.7037733|-8.0211063|86.0010337 unknown
InChI: InChI=1S/C11H14ClNO/c1-7(2)11(14)13-10-8(3)5-4-6-9(10)12/h4-7,13H,1-3H3
charge 0 multiplicity 1
28 atoms
Cl 0.824976 2.859252 -0.517728
O  -1.55631 -1.060729 1.122577
N  -0.566132 0.183272 -0.604539
C  -3.036261 0.021187 -0.514114
C  -1.666297 -0.341065 0.088888
C  0.806809 0.064615 -0.228662
C  -3.735341 -1.276619 -0.995915
C  -3.889766 0.749862 0.553727
C  1.430488 -1.199596 0.009414
C  1.60343 1.23745 -0.147415
C  2.799861 -1.213648 0.377781
C  0.679684 -2.500868 -0.171148
C  2.963299 1.218955 0.195781
C  3.560603 -0.030006 0.47861
H  -2.896263 0.693006 -1.385888
H  -3.151944 -1.786479 -1.784374
H  -4.736486 -1.044042 -1.401608
H  -3.852511 -1.973259 -0.147415
H  -4.894351 0.976195 0.152829
H  -3.421398 1.698782 0.872106
H  -4.000572 0.106972 1.444091
H  -0.776127 0.915705 -1.289433
H  3.277723 -2.180943 0.568628
H  -0.011138 -2.671678 0.673673
H  0.058426 -2.479171 -1.085722
H  1.381657 -3.348469 -0.24483
H  3.533156 2.150357 0.249779
H  4.617685 -0.073137 0.760005
