program: Gaussian 09
title: 000010279
version: EM64L-G09RevD.01
frameworkgroup: C1[X(C8H8O3)]
method: RPBEPBE
basis: SDD
operation: Freq
keyword: #p
keyword: freq=noraman
keyword: PBEPBE/SDD
title: #p freq=noraman PBEPBE/SDD
converged: NO NO NO NO
title: Mulliken charges:
elementType: O O O C C C C C C C C H H H H H H H H
charge: -0.372450 -0.434429 -0.191737 0.272746 0.148353 -0.486486 0.278456 -0.364692 0.121551 -0.328673 -0.798534 0.238473 0.221705 0.258185 0.232741 0.232761 0.264464 0.352822 0.354743
chargesum: 0.00000
title: Mulliken charges with hydrogens summed into heavy atoms:
elementType: O O O C C C C C C C C
charge: -0.019628 -0.079686 -0.191737 0.272746 0.148353 -0.248013 0.278456 -0.142988 0.121551 -0.070488 -0.068568
polarizability: 1.32198107e+02 4.06614093e-01 1.18605629e+02 -8.77735124e-03 1.26423671e-04 4.41928292e+01
1716.lowfreq: -9.3839 -8.9254 -0.0010 -0.0008 -0.0007 12.8751 26.4515 110.6787 159.7067
frequency: 25.0429 110.6666 159.7047 193.7879 195.2812 307.9370 325.6049 352.2421 368.9328 382.4503 400.6909 424.6392 456.3680 489.9069 514.1568 604.6302 617.7399 692.7476 725.8345 757.2593 809.7362 852.5416 895.3472 932.7790 940.3009 1020.6134 1050.2173 1104.3104 1139.3757 1160.5276 1216.5407 1253.1852 1278.5394 1307.7149 1364.4570 1400.0114 1411.5315 1451.9796 1468.7474 1502.7259 1578.5446 1606.7956 1626.3367 2980.0586 3066.8621 3113.4914 3120.0421 3138.1039 3174.6769 3532.3151 3588.1907
redmass: 5.0482 4.5794 4.8071 5.0643 1.0662 5.7103 1.1271 5.2642 3.8514 7.8086 1.1412 3.3318 7.3070 3.7603 2.6957 4.1539 3.0222 6.6143 3.0998 5.9099 1.5269 1.5554 6.2527 1.3435 2.2750 1.8148 2.2075 1.6716 1.5003 1.1781 1.7854 3.0108 3.0913 1.7022 1.2277 5.6756 3.4677 1.0948 1.0505 2.8374 6.4622 7.0761 6.8297 1.0372 1.0977 1.0901 1.0988 1.0900 1.0951 1.0656 1.0662
irintensity: 6.6133 0.0128 0.4894 2.2598 0.8970 13.1806 145.6842 0.0137 10.9460 14.3601 130.0449 2.0477 1.1940 2.6552 26.4354 18.2587 4.9104 10.7366 0.0122 35.2731 43.8811 29.7592 13.7670 0.0733 23.3267 2.6610 20.2209 234.9225 99.5484 74.2364 165.9669 14.9004 102.5926 24.6089 43.2054 87.3077 64.8824 39.3630 19.3814 41.1980 183.6607 37.8996 2.4142 5.9501 16.2255 16.8925 13.3183 8.5636 3.9204 25.7433 35.6090
temp: 298.150 k
press: 1.00000 atm
elementType: 8 8 8 6 6 6 6 6 6 6 6 1 1 1 1 1 1 1 1
symmnumber: 1
zpe: 371992.1 jmol-1
zpe.correction: 0.141684 hartree
zpe.thermalcorrener: 0.152148 hartree
zpe.thermalcorrenthalpy: 0.153092 hartree
zpe.thermalcorrgfe: 0.105333 hartree
zpe.sumelectzpe: -534.499311 hartree
zpe.sumelectthermal: -534.488848 hartree
zpe.sumelectthermalent: -534.487903 hartree
zpe.sumelectthermalfe: -534.535662 hartree
dipole: 3.1815 -1.0595 0.0003
dipole: 3.3533
quadrupole: -79.7491 -42.5306 -66.4411
quadrupole: 4.7670 0.0029 0.0000
quadrupole: -16.8422 20.3764 -3.5342 4.7670 0.0029 0.0000
hfenergy: -534.6409953 hartree
pointgroup: C01 [X(C8H8O3)]
dipole: -1.24848 0.4263511 0.0001314 debye
dipolederiv: -0.478903 0.7770858 -0.0000227 0.5509803 -0.8059943 -0.0000406 -0.0000226 -0.0000529 -0.3707756 -0.8842747 0.653141 -0.0000116 0.7775363 -0.6245639 0.0001332 -0.0000134 0.0001228 -0.4252863 -1.0163968 -0.0307586 -0.0001827 0.144837 -0.4907576 0.0001131 -0.0000501 -0.0000089 -0.2989235 -0.6851715 -0.4575218 -0.0000811 -0.0955114 -0.2693931 -0.0000317 -0.0001258 -0.0000786 0.001439 0.4129479 -0.8042655 -0.00001 -0.4137813 0.6922926 0.0000441 -0.0000483 -0.0000093 0.0600177 0.0271957 0.4442484 0.000043 -0.1610709 -0.068822 -0.0000198 -0.0000013 0.0000469 -0.1910992 0.6126699 -0.8153183 0.0000332 -0.9655543 0.401084 -0.0001182 0.0000289 -0.0000555 0.0604003 -0.0898988 0.4227285 0.0000175 -0.0601064 0.0374344 -0.0000249 0.0000324 -0.0000206 -0.1835074 1.4988643 0.4070722 0.000269 0.3156447 1.0668402 -0.0001009 0.0002093 -0.0000286 0.1156802 -0.0088127 -0.1028717 -0.0000161 0.393137 0.1144967 0.0000313 -0.0000262 -0.000039 -0.1323456 -0.0563598 -0.053529 -0.0000067 -0.1671074 -0.5137176 0.0000751 0.0000347 0.000176 0.0647106 0.1167962 0.006206 -0.0000075 0.0043473 -0.0913353 0.0000007 -0.0000112 -0.0000004 0.1527806 0.0727173 0.0162287 -0.0000039 -0.0285591 -0.1301476 0.0000123 0.0000115 0.000014 0.1673647 -0.0355497 -0.041982 -0.0000008 -0.0419445 0.0967707 0.0000072 0.0000048 0.0000156 0.1689122 0.065174 0.0495021 0.1056416 0.0231104 0.0461349 -0.04022 0.0793007 -0.0680363 -0.0334022 0.0651708 0.0494303 -0.1056432 0.0230823 0.046179 0.0401652 -0.0793169 0.0679744 -0.0334295 -0.099789 -0.0841724 -0.0000049 -0.0088227 0.090779 0.0000009 -0.0000046 0.0000033 0.1191979 0.2215537 -0.2399933 0.0000319 -0.1316132 0.2122235 0.0000249 0.0000066 0.0000601 0.3737234 0.2620663 -0.1952304 -0.000045 -0.158604 0.1904964 -0.0000518 -0.0000085 -0.000083 0.384543 unknown
polarizability: 132.2035132|0.3030307|118.6002233|0.0087761|-0.0001933|44.1928292 unknown
InChI: InChI=1S/C8H8O3/c1-5(9)7-4-6(10)2-3-8(7)11/h2-4,10-11H,1H3
charge 0 multiplicity 1
19 atoms
O  1.252226 -2.217975 0.000022
O  -3.011318 1.469506 -0.000289
O  2.944907 -0.112361 0.000438
C  0.523694 0.116971 0.000103
C  0.215245 -1.282706 -0.000001
C  -0.570041 1.031961 -0.000068
C  -1.908953 0.595985 -0.000217
C  -1.139456 -1.710262 -0.000058
C  1.931438 0.643567 0.000438
C  -2.197888 -0.788383 -0.000155
C  2.129517 2.166614 0.000143
H  -0.358362 2.107495 -0.00003
H  -1.365586 -2.785105 0.000019
H  -3.240067 -1.120165 -0.000129
H  1.679794 2.637426 0.894527
H  1.679843 2.637101 -0.894439
H  3.212341 2.364859 0.000132
H  0.877331 -3.13671 0.000157
H  -2.716964 2.41358 -0.000092
