program: Gaussian 09
title: 000144366
version: EM64L-G09RevD.01
frameworkgroup: C1[X(C9H14O)]
method: RPBEPBE
basis: SDD
operation: Freq
keyword: #pfreq=noraman
keyword: PBEPBE/SDD
title: #p freq=noraman PBEPBE/SDD
converged: YES YES NO NO
title: Mulliken charges:
elementType: O C C C C C C C C C H H H H H H H H H H H H H H
charge: -0.280900 -0.076211 -0.587511 -0.499871 0.622754 0.307894 -0.729901 -0.540024 -0.795629 -0.510302 0.234707 0.220372 0.217612 0.208498 0.215913 0.212959 0.206499 0.222473 0.244894 0.214466 0.221369 0.240615 0.211782 0.217543
chargesum: 0.00000
title: Mulliken charges with hydrogens summed into heavy atoms:
elementType: O C C C C C C C C C
charge: -0.280900 0.158496 -0.163100 -0.061887 0.622754 0.307894 -0.087970 -0.295131 -0.359794 0.159638
polarizability: 1.40027129e+02 -2.41375639e+01 1.14409453e+02 1.67407440e-01 2.59201770e+00 6.50368412e+01
1716.lowfreq: -14.5256 -8.4886 -0.0006 0.0007 0.0008 5.4209 48.4189 101.3225 126.1266
frequency: 48.4126 101.3178 126.0997 150.8232 188.2788 199.5402 212.6869 273.4595 346.7465 392.6461 409.7418 430.8583 479.2675 493.4985 551.0333 581.7274 686.6249 835.6770 853.0047 866.9543 875.6992 883.8812 918.5298 929.0835 949.7807 975.7103 1008.4360 1071.5785 1089.7931 1105.5752 1119.3208 1146.1599 1164.6588 1177.2957 1251.2407 1269.8502 1276.4081 1316.9669 1337.6592 1339.4093 1360.6649 1385.9812 1435.5208 1438.9269 1443.9260 1455.3972 1464.8681 1471.2361 1474.1426 1475.4069 1618.6516 1657.3425 2944.5966 2949.4461 2960.7465 2966.7066 2980.8131 3009.2865 3037.3879 3047.4723 3060.9701 3069.0235 3091.8356 3117.9475 3138.3846 3195.1418
redmass: 2.1435 2.2112 2.2330 1.8265 1.9718 1.0454 3.5275 2.5354 2.9662 3.1671 2.4456 2.9600 2.8515 2.9773 3.2869 3.6893 1.0709 3.0122 2.2982 1.9176 1.4402 2.0302 1.4615 2.3113 1.9600 1.7346 1.8063 2.1210 2.1240 1.2550 1.9336 1.1814 1.9366 2.1594 1.3067 1.2584 1.2737 1.8017 1.3758 2.1817 2.8469 1.2195 1.2355 1.1549 1.0983 1.0916 1.0529 1.0526 1.0510 1.0521 5.0314 7.0182 1.0617 1.0664 1.0340 1.0369 1.0812 1.0962 1.0959 1.1031 1.0991 1.0990 1.0611 1.0995 1.0911 1.1141
irintensity: 8.7132 0.4143 1.0560 1.7082 1.2950 0.0380 4.4033 0.2596 4.1016 4.4148 1.4200 0.2183 2.5507 5.3920 11.0633 11.4121 2.4197 5.4491 9.1935 1.9480 1.0711 9.1324 102.6668 4.6306 3.7982 13.9007 18.1863 17.7321 1.4870 7.9407 84.0892 3.8258 2.4459 152.5549 1.7642 2.2596 1.5261 40.1960 0.7754 2.8891 69.2020 11.8005 6.1185 0.7688 14.4369 3.4506 13.2333 26.2757 8.2873 12.9393 2.7006 172.7629 14.9136 17.6981 100.9478 42.2528 25.8814 27.7046 22.2799 52.9479 60.9673 38.9047 6.6942 26.1882 9.3089 21.1942
temp: 298.150 k
press: 1.00000 atm
elementType: 8 6 6 6 6 6 6 6 6 6 1 1 1 1 1 1 1 1 1 1 1 1 1 1
symmnumber: 1
zpe: 542430.3 jmol-1
zpe.correction: 0.206601 hartree
zpe.thermalcorrener: 0.217504 hartree
zpe.thermalcorrenthalpy: 0.218448 hartree
zpe.thermalcorrgfe: 0.170242 hartree
zpe.sumelectzpe: -425.754550 hartree
zpe.sumelectthermal: -425.743647 hartree
zpe.sumelectthermalent: -425.742703 hartree
zpe.sumelectthermalfe: -425.790909 hartree
dipole: -1.1271 2.6699 0.8356
dipole: 3.0161
quadrupole: -55.6077 -62.1730 -63.8475
quadrupole: -2.1215 -2.1899 -0.2638
quadrupole: 4.9350 -1.6302 -3.3048 -2.1215 -2.1899 -0.2638
hfenergy: -425.9611504 hartree
pointgroup: C01 [X(C9H14O1)]
dipole: 0.2176706 -1.0800675 0.4406256 debye
dipolederiv: -1.7017997 0.6605305 -0.1783907 0.2218973 -0.5577614 0.0277309 0.1770177 -0.1348226 -0.3005513 0.1294172 0.0656628 0.0068635 0.0354263 0.0835187 0.0076208 0.040959 0.0378456 0.143978 0.0309243 -0.0239694 0.0449218 -0.0291094 -0.0771717 0.0107148 0.0313209 0.0551207 0.1443689 -0.193366 -0.0584809 -0.006619 -0.1570931 -0.0626732 0.019651 0.0376608 0.0018527 0.1956701 0.5674705 -0.2420183 0.0074228 -0.0923383 0.2784487 -0.08715 -0.0581947 -0.1210739 0.0270155 1.4291196 -0.482993 0.050591 -0.1429155 0.5607323 0.0190924 -0.2187876 0.0600144 -0.0470814 0.0296597 -0.06973 0.0130429 -0.0649861 -0.0409042 0.0247938 -0.0022732 0.0034538 0.1024583 -0.4716513 0.1899435 -0.0533777 0.281812 -0.2824043 -0.0173686 -0.0585922 0.0393265 -0.2272712 -0.2143531 0.2423464 -0.0923524 0.2412459 -0.3008332 -0.0707576 -0.0719308 -0.0739698 -0.4636003 0.588534 -0.2183782 0.1256887 -0.4341326 0.5301859 -0.0838404 0.203287 -0.0447528 0.3748311 0.0204679 -0.0005524 0.0142795 0.0104783 0.0374055 0.0359957 -0.0069133 0.0001147 -0.163695 0.0183609 0.0598611 0.0620008 0.11213 -0.0854209 -0.0573564 0.0873533 -0.1067956 0.0316857 0.0782495 -0.0309894 -0.0061819 0.0267263 -0.0147032 0.0522133 -0.0498922 0.096512 -0.1207875 0.0724399 -0.0035511 -0.0260774 -0.0178941 0.0023864 0.0609251 0.0305794 0.0319439 -0.1528254 -0.1701139 -0.0110731 -0.0377546 0.0242738 0.047016 0.004678 -0.0659605 -0.0115358 0.0698951 0.0327574 0.1315918 0.0579593 0.0507293 -0.1233532 -0.062043 0.0458564 -0.0775971 0.0506833 0.0777804 -0.0049588 -0.023002 -0.0114007 0.0693123 -0.0202697 0.0234503 0.0563607 -0.1747224 -0.1593123 -0.0681332 -0.0700443 0.0158024 0.070901 0.0176966 -0.0767985 0.0024141 0.0652875 0.0049662 -0.044453 0.0197328 -0.1046486 -0.0367218 0.0325259 0.023199 0.0428636 0.1637156 -0.1255084 0.0259771 0.0215655 -0.0204708 0.0724254 0.0291844 0.0357084 0.0183236 0.1783818 0.0158545 -0.1020588 0.0408485 -0.0658124 -0.0731035 0.0625992 0.0296836 0.0827181 0.183106 -0.1655809 0.0079338 0.0251609 -0.0449373 0.0856512 0.0293831 0.0487671 0.0243692 0.0918693 0.0699704 -0.0667838 -0.0430164 0.0548182 -0.1985008 -0.0319628 -0.0767216 -0.0494219 0.028492 0.0357133 0.0442764 0.0467384 0.1103993 0.0155682 -0.0040565 -0.1287782 0.0667358 -0.2009039 unknown
polarizability: 129.7360553|-26.8398678|123.4898154|4.0833228|-8.9896267|66.247552 unknown
InChI: InChI=1S/C9H14O/c1-7-4-8(2)6-9(5-7)10-3/h5,8H,1,4,6H2,2-3H3
charge 0 multiplicity 1
24 atoms
O  2.44496 0.32007 -0.154583
C  -1.123334 -1.052738 -0.211096
C  -1.81251 0.198801 0.388423
C  0.371967 -1.089769 0.207361
C  -1.11401 1.492845 -0.022766
C  1.041856 0.25756 0.003971
C  -1.84551 -2.35304 0.196664
C  0.345681 1.429181 -0.1307
C  -1.807889 2.653477 -0.234086
C  3.259404 -0.680027 0.546413
H  -1.154652 -0.95807 -1.316119
H  0.89322 -1.862655 -0.392873
H  0.449322 -1.41028 1.268979
H  -1.79294 0.110065 1.496311
H  -2.876793 0.227949 0.089108
H  -1.339213 -3.244291 -0.219731
H  -1.871792 -2.460768 1.298552
H  -2.889704 -2.357409 -0.166899
H  0.904904 2.352239 -0.322385
H  -2.899337 2.694289 -0.145978
H  -1.29649 3.587117 -0.496807
H  4.298248 -0.451595 0.264551
H  3.016481 -1.713774 0.234619
H  3.143931 -0.591275 1.644471
