program: Gaussian 09
title: 000144339
version: EM64L-G09RevD.01
frameworkgroup: C1[X(C7H3NO2S)]
method: RPBEPBE
basis: SDD
operation: Freq
keyword: #p
keyword: freq=noraman
keyword: PBEPBE/SDD
title: #p freq=noraman PBEPBE/SDD
converged: NO YES NO YES
title: Mulliken charges:
elementType: S O O N C C C C C C C H H H
charge: 0.205877 -0.108502 -0.104320 0.006862 0.393449 0.315726 -0.290049 -0.295380 -0.262973 -0.393808 -0.299559 0.278615 0.291381 0.262680
chargesum: 0.00000
title: Mulliken charges with hydrogens summed into heavy atoms:
elementType: S O O N C C C C C C C
charge: 0.205877 -0.108502 -0.104320 0.006862 0.393449 0.315726 -0.290049 -0.295380 0.015642 -0.102427 -0.036878
polarizability: 1.36264962e+02 3.46542036e+00 1.28582741e+02 9.76472447e-03 1.45034810e-02 3.82233896e+01
1716.lowfreq: -8.9789 -2.4747 -0.0012 0.0015 0.0022 5.7973 94.3050 126.7822 176.6706
frequency: 94.3043 126.7778 176.6700 231.1057 315.6309 363.2639 398.7183 405.5272 447.0172 469.8349 521.0044 623.9019 641.9889 669.2071 682.3517 768.3557 813.1595 860.4510 898.8718 946.9038 984.7430 1016.3013 1127.9362 1177.0278 1218.7351 1285.3427 1308.5384 1398.9963 1448.7321 1554.4904 1579.3252 1648.0523 1675.9437 3151.2066 3161.4585 3180.2016
redmass: 18.2765 5.1125 7.6224 7.5585 14.6991 3.0075 16.2550 15.5813 8.3555 12.8204 10.5388 6.2280 5.9522 8.5853 7.7068 4.5686 8.6266 1.3381 8.7294 1.4578 1.4645 2.2863 6.0338 1.8692 3.0167 1.5777 9.2881 1.9971 2.1649 6.8164 9.0149 12.9432 13.0484 1.0898 1.0939 1.0973
irintensity: 2.1647 1.0951 4.8835 5.9157 2.9782 1.0843 12.7546 21.2865 4.1775 7.6720 3.7860 18.1355 4.2039 39.2480 28.2580 1.3057 38.5342 37.3534 96.7343 2.3593 0.8043 2.9323 2.7147 5.0199 152.2876 7.8409 9.0159 19.7625 0.2796 30.1909 20.8744 513.5333 16.7488 9.5604 0.3598 4.0580
temp: 298.150 k
press: 1.00000 atm
elementType: 16 8 8 7 6 6 6 6 6 6 6 1 1 1
symmnumber: 1
zpe: 223534.7 jmol-1
zpe.correction: 0.085140 hartree
zpe.thermalcorrener: 0.093634 hartree
zpe.thermalcorrenthalpy: 0.094578 hartree
zpe.thermalcorrgfe: 0.051053 hartree
zpe.sumelectzpe: -871.052444 hartree
zpe.sumelectthermal: -871.043950 hartree
zpe.sumelectthermalent: -871.043005 hartree
zpe.sumelectthermalfe: -871.086531 hartree
dipole: 2.6299 1.2957 0.0011
dipole: 2.9317
quadrupole: -74.2871 -76.7395 -69.1317
quadrupole: 5.9946 -0.0001 -0.0054
quadrupole: -0.9010 -3.3534 4.2544 5.9946 -0.0001 -0.0054
hfenergy: -871.1375837 hartree
pointgroup: C01 [X(C7H3N1O2S1)]
dipole: -1.020597 -0.5373963 0.0004244 debye
dipolederiv: -0.5019267 0.0141603 0.0000381 0.0610533 -0.8670689 0.0000944 0.0002164 -0.0000284 -0.0135742 -0.4346758 0.110625 -0.0000423 0.0349518 -1.187832 0.0003112 -0.0000264 0.0001851 -0.2491238 -0.4442194 -0.0877909 -0.0000332 -0.0275378 -1.2165526 -0.0001322 -0.0001149 0.0008167 -0.2495445 -0.3296724 -0.0362634 0.0000161 0.0093782 -0.3349646 -0.000005 0.0000207 0.0000365 -0.2457045 -0.2840838 0.1425445 0.0000096 0.1798921 -0.0314726 0.0000566 -0.0001241 -0.000019 0.0416307 -0.5841548 -0.0490712 0.0000992 -0.1269919 -0.3172487 0.0000287 -0.0001931 0.0001058 0.0687177 0.9905144 0.2165395 -0.0000404 0.2449728 1.6585042 -0.0005412 -0.0000239 -0.0004438 0.1353612 1.1914244 -0.2241491 -0.0000819 -0.2497538 1.670747 0.0001746 0.0002333 -0.0005848 0.1528158 -0.3988306 -0.1672443 0.0000077 0.1564067 0.1028588 0.0000061 -0.0000279 -0.0000035 -0.0349143 0.1485776 -0.0547748 0.0000126 -0.1241939 0.3512029 0.0000061 -0.0000055 -0.0000176 -0.0006869 0.4466245 0.212773 0.0000115 -0.0607521 0.1187892 -0.0000076 0.0000477 -0.0000155 -0.0439325 0.1170224 0.0435526 -0.0000022 -0.0168604 0.0057647 0.000003 0.0000479 -0.0000074 0.1596211 0.1038309 -0.0301753 0.0000029 -0.0147551 0.0027861 0.0000028 -0.0000007 -0.0000244 0.1397909 -0.0204306 -0.0907259 0.0000023 -0.0658098 0.0444866 0.0000024 -0.0000496 0.0000002 0.1395433 unknown
polarizability: 136.0730472|3.6669658|128.7746554|-0.0093711|-0.0147609|38.2233896 unknown
InChI: InChI=1S/C7H3NO2S/c9-6-4-1-2-8-3-5(4)7(10)11-6/h1-3H
charge 0 multiplicity 1
14 atoms
S  2.568758 0.058461 -0.000432
O  1.559208 -2.533348 0.000528
O  1.418543 2.596414 -0.000806
N  -2.55877 0.659063 -0.000038
C  -0.088256 -0.718705 0.000225
C  -0.128819 0.694563 0.000142
C  1.283008 -1.322544 0.000244
C  1.196283 1.37553 0.00036
C  -1.289892 -1.450342 0.00025
C  -1.379857 1.351672 -0.000043
C  -2.499829 -0.707998 0.000088
H  -1.287546 -2.543696 0.000292
H  -1.445139 2.444079 -0.000043
H  -3.467093 -1.221448 0.000033
