program: Gaussian 09
title: 000144321
version: EM64L-G09RevD.01
frameworkgroup: C1[X(C9H20P2)]
method: RPBEPBE
basis: SDD
operation: Freq
keyword: #pfreq=noraman
keyword: PBEPBE/SDD
title: #p freq=noraman PBEPBE/SDD
converged: YES YES NO NO
title: Mulliken charges:
elementType: P P C C C C C C C C C H H H H H H H H H H H H H H H H H H H H
charge: 0.328000 0.327933 -0.988295 -0.127461 -0.127268 -0.661031 -0.659541 -0.665525 -0.661361 -0.659551 -0.665586 0.291664 0.291744 0.243852 0.212709 0.207166 0.219360 0.236391 0.207425 0.221947 0.213786 0.225281 0.244201 0.212848 0.207132 0.219271 0.236584 0.207452 0.221888 0.213768 0.225215
chargesum: 0.00000
title: Mulliken charges with hydrogens summed into heavy atoms:
elementType: P P C C C C C C C C C
charge: 0.328000 0.327933 -0.404887 -0.127461 -0.127268 0.002696 0.003635 -0.004512 0.002821 0.003756 -0.004714
polarizability: 1.99284602e+02 -5.18120829e-03 1.26138462e+02 6.12138386e+00 5.63676652e-03 1.26367441e+02
1716.lowfreq: -12.4957 -8.5235 0.0013 0.0013 0.0020 11.3385 33.4511 53.1880 75.8162
frequency: 31.8822 53.1715 75.8143 81.8865 158.1795 216.0956 219.8732 227.6585 256.5288 266.1988 267.6416 272.3541 280.7080 284.1490 288.3592 330.1899 341.8633 344.6231 370.4721 383.4672 386.0276 396.5834 432.1673 517.6658 525.5152 553.0153 709.4769 795.7703 800.0525 801.6839 927.6882 930.9100 931.2949 936.7876 938.2640 945.9933 946.0858 1007.5066 1010.8592 1011.2665 1018.0394 1024.5549 1168.0750 1173.4010 1210.8978 1212.8700 1226.4987 1227.2041 1368.3779 1371.8763 1373.3601 1373.7175 1387.2119 1398.9763 1399.4300 1455.3389 1455.6191 1460.5274 1461.7222 1463.3503 1467.4472 1476.6347 1476.9551 1480.5842 1481.2581 1488.4082 1490.3671 2958.6052 2958.7191 2960.7006 2960.8262 2964.7569 2965.6403 3047.2997 3047.9575 3052.9598 3053.2888 3058.6046 3059.2257 3067.9610 3068.2225 3073.1106 3073.2998 3078.3132 3078.4993 3094.5848 3194.1348
redmass: 2.7452 4.2111 3.6660 4.0560 4.4633 1.0480 1.0695 2.3030 1.6281 1.0593 1.6165 1.5505 1.3728 1.2843 2.0245 2.2743 2.9800 3.1333 3.3184 2.4129 2.4083 2.4172 6.0056 3.1248 3.0254 6.6643 6.8435 1.5981 3.0683 2.3907 1.1820 1.6395 1.5795 1.5479 1.4173 1.2015 1.2008 1.3967 1.3335 1.4138 1.4221 1.2622 2.0173 2.0010 2.8759 2.9161 3.0862 3.0787 1.1831 1.1957 1.1891 1.1898 1.1059 1.1949 1.1840 1.0496 1.0495 1.0481 1.0482 1.0474 1.0485 1.0508 1.0506 1.0497 1.0502 1.0508 1.0508 1.0355 1.0354 1.0355 1.0355 1.0361 1.0360 1.0982 1.0979 1.0988 1.0987 1.0976 1.0974 1.1008 1.1008 1.0996 1.0995 1.0994 1.0993 1.0532 1.1121
irintensity: 0.0015 0.1229 0.2848 1.1910 0.0184 0.0131 0.0193 0.1685 0.1763 0.0054 0.0348 0.0296 0.1035 0.0532 0.1570 0.2156 0.1240 1.4990 0.8231 0.0868 0.0143 0.4895 3.2335 0.8056 0.0157 0.4621 9.2910 7.1706 0.3816 26.1836 0.5553 1.6909 1.1606 1.3739 1.5848 0.0150 0.0884 4.3206 0.5146 0.0251 2.1749 8.2700 144.0003 5.5582 4.2731 4.9607 0.8518 1.2041 11.9059 23.4068 35.9824 24.7375 20.7680 20.9778 0.0557 0.0369 0.2896 0.3609 1.4909 0.0825 0.2182 16.1013 19.6922 18.6847 14.3508 44.4180 0.0651 30.2139 24.7226 20.2989 40.4715 119.5696 11.3954 19.0317 9.8488 4.6389 5.0442 170.8345 9.9088 5.3108 1.7068 5.7855 74.6170 56.7724 1.9857 15.8882 0.7574
temp: 298.150 k
press: 1.00000 atm
elementType: 15 15 6 6 6 6 6 6 6 6 6 1 1 1 1 1 1 1 1 1 1 1 1 1 1 1 1 1 1 1 1
symmnumber: 1
zpe: 703793.8 jmol-1
zpe.correction: 0.268061 hartree
zpe.thermalcorrener: 0.283918 hartree
zpe.thermalcorrenthalpy: 0.284862 hartree
zpe.thermalcorrgfe: 0.226067 hartree
zpe.sumelectzpe: -1036.488104 hartree
zpe.sumelectthermal: -1036.472247 hartree
zpe.sumelectthermalent: -1036.471303 hartree
zpe.sumelectthermalfe: -1036.530098 hartree
dipole: 0.0048 -0.4342 0.0033
dipole: 0.4342
quadrupole: -79.3550 -85.3024 -90.2406
quadrupole: -0.0020 -1.7022 -0.0089
quadrupole: 5.6110 -0.3364 -5.2746 -0.0020 -1.7022 -0.0089
hfenergy: -1036.756165 hartree
pointgroup: C01 [X(C9H20P2)]
dipole: 0.0020779 -0.1708011 -0.0020161 debye
polarizability: 199.4205684|-0.0352903|126.1381396|5.2475961|0.008988|126.2317975 unknown
InChI: InChI=1S/C9H20P2/c1-8(2,3)10-7-11-9(4,5)6/h7H2,1-6H3
charge 0 multiplicity 1
31 atoms
P  0.788756 -0.151862 0.870715
P  -0.793323 -0.122001 -0.897795
C  0.000115 -1.647723 -0.039953
C  2.472318 0.210502 -0.083817
C  -2.47483 0.203117 0.074434
C  2.638316 -0.543696 -1.419464
C  2.513649 1.740236 -0.325271
C  3.594345 -0.205174 0.906359
C  -2.634627 -0.602923 1.380229
C  -2.515957 1.722364 0.374178
C  -3.59991 -0.174979 -0.927115
H  0.637222 -2.238333 -0.707368
H  -0.635687 -2.263587 0.605486
H  1.811257 -0.324589 -2.12001
H  3.584145 -0.226381 -1.902349
H  2.694284 -1.638073 -1.271606
H  2.358643 2.305035 0.613264
H  1.731498 2.046715 -1.042835
H  3.500576 2.031011 -0.737149
H  3.566886 -1.289894 1.119789
H  4.584721 0.031528 0.469318
H  3.508942 0.33482 1.867638
H  -1.804041 -0.411476 2.084715
H  -3.578068 -0.305741 1.880428
H  -2.691185 -1.690443 1.189038
H  -2.3657 2.322433 -0.543047
H  -1.730125 2.002194 1.098585
H  -3.500998 1.99691 0.801333
H  -3.574629 -1.251235 -1.179986
H  -4.588848 0.047228 -0.479311
H  -3.516145 0.399416 -1.868432
