program: Gaussian 09
title: 000144313
version: EM64L-G09RevD.01
frameworkgroup: C1[X(C10H10)]
method: RPBEPBE
basis: SDD
operation: Freq
keyword: #p
keyword: freq=noraman
keyword: PBEPBE/SDD
title: #p freq=noraman PBEPBE/SDD
converged: NO NO NO NO
title: Mulliken charges:
elementType: C C C C C C C C C C H H H H H H H H H H
charge: -0.669034 -0.669032 0.261226 0.261210 0.516435 -0.398120 -0.398118 -0.233416 -0.233417 -0.755889 0.237924 0.237922 0.237925 0.237921 0.238029 0.238030 0.224243 0.224244 0.220959 0.220956
chargesum: 0.00000
title: Mulliken charges with hydrogens summed into heavy atoms:
elementType: C C C C C C C C C C
charge: -0.193187 -0.193186 0.261226 0.261210 0.516435 -0.160091 -0.160088 -0.009172 -0.009173 -0.313974
polarizability: 1.44088061e+02 -1.45528177e-04 1.05415942e+02 -4.58500963e-03 3.48116285e-03 4.96199961e+01
1716.lowfreq: -0.0003 0.0004 0.0006 11.9403 13.0495 20.2697 42.9229 169.9100 224.3929
frequency: 42.9228 169.9008 224.3927 268.6642 407.6691 434.4748 437.0235 465.3240 483.8624 584.0701 638.8961 659.5291 716.0542 749.2186 781.9460 818.9571 844.0909 867.9456 912.4112 933.0837 935.3383 940.6391 984.6455 986.1082 1022.0685 1091.1834 1138.7186 1158.2741 1169.3908 1176.4581 1198.9558 1209.0384 1261.4278 1262.3386 1298.5924 1385.6615 1426.5749 1437.9252 1441.4299 1448.4222 1478.6718 1594.7117 1619.1076 1683.4344 2976.9460 2980.0745 3023.2672 3024.3317 3086.9320 3116.2150 3122.5821 3137.2771 3157.5568 3187.5303
redmass: 2.8951 2.3371 2.9316 2.9888 2.2430 2.6546 2.6955 6.1061 2.7394 6.3573 5.8250 1.2452 2.0985 1.1910 3.6371 3.6848 4.7731 1.2788 1.3663 1.3979 1.7484 1.6827 1.3161 1.9105 2.2114 2.2506 1.1256 1.1625 1.0676 2.3630 1.6091 1.4567 2.7850 2.5102 1.4663 6.1740 1.1746 1.1368 1.1644 2.2089 2.4993 6.6262 7.1441 6.2645 1.0593 1.0605 1.0999 1.1018 1.0626 1.0854 1.0896 1.0944 1.1003 1.1144
irintensity: 0.8337 0.0000 10.5579 0.0887 18.0655 0.4235 0.8963 0.0528 0.0000 0.8186 2.0013 0.0000 0.0000 89.4842 0.0257 0.2165 0.8768 0.0000 38.7009 22.7508 0.0000 0.0476 0.0000 26.0132 6.5862 2.5415 0.0000 0.0380 0.0002 1.5006 8.2583 2.4872 0.0619 2.9337 1.3679 5.2732 3.1955 11.1408 6.4060 11.6928 25.6615 0.4842 0.6190 33.8218 38.1633 5.8529 0.0015 28.4838 11.2778 5.0747 3.6101 35.9848 33.7130 17.1295
temp: 298.150 k
press: 1.00000 atm
elementType: 6 6 6 6 6 6 6 6 6 6 1 1 1 1 1 1 1 1 1 1
symmnumber: 1
zpe: 434258.0 jmol-1
zpe.correction: 0.165400 hartree
zpe.thermalcorrener: 0.173468 hartree
zpe.thermalcorrenthalpy: 0.174412 hartree
zpe.thermalcorrgfe: 0.132262 hartree
zpe.sumelectzpe: -386.342882 hartree
zpe.sumelectthermal: -386.334814 hartree
zpe.sumelectthermalent: -386.333870 hartree
zpe.sumelectthermalfe: -386.376020 hartree
dipole: 0.0024 0.0000 0.0006
dipole: 0.0025
quadrupole: -55.9137 -52.0321 -63.6069
quadrupole: 0.0000 0.0008 0.0007
quadrupole: 1.2706 5.1521 -6.4227 0.0000 0.0008 0.0007
hfenergy: -386.5082822 hartree
pointgroup: C01 [X(C10H10)]
dipole: 0.0009441 -0.0000036 0.0002299 debye
dipolederiv: -0.0223316 -0.0193526 -0.0000008 -0.0060387 -0.0793942 0.0000358 0.000037 0.0000502 0.1963202 -0.0223395 0.0193462 -0.0000303 0.0060368 -0.0793909 -0.0001229 0.000014 -0.0001692 0.19632 0.1860386 -0.1232118 -0.0000022 -0.3253972 -0.0295745 -0.0000112 0.0000216 -0.0000547 -0.0502434 0.186021 0.123219 0.0000563 0.3254061 -0.0295592 0.0000255 0.0001582 0.0001068 -0.0502429 0.3622614 0.0000017 -0.0001877 -0.0000012 0.2450489 0.0000439 -0.0003823 0.0000466 -0.0669912 -0.0931008 0.0463665 0.0000293 0.0404505 0.1230013 0.0000059 0.0000014 0.0000161 -0.1660904 -0.0931024 -0.0463744 0.0000077 -0.0404644 0.1229961 0.0000173 -0.0000206 -0.0000118 -0.1660908 0.0098589 0.0350396 0.0000181 0.1070037 -0.0170174 0.0000209 0.0000086 0.0000161 -0.1679471 0.0098635 -0.0350354 0.0000322 -0.1069987 -0.017018 -0.0000167 0.0000335 -0.0000128 -0.1679457 -0.3557553 -0.0000096 -0.0000678 -0.0000113 0.0907349 0.0000485 -0.0000397 0.0000533 -0.4687068 -0.0365955 0.0210596 -0.0274789 -0.0037493 -0.0010038 0.0916684 -0.0443567 0.1239118 -0.0231327 -0.0365631 0.0210882 0.0275171 -0.0036976 -0.0010778 -0.0916523 0.0443875 -0.1239157 -0.0230336 -0.0365549 -0.0210981 0.0275187 0.0036715 -0.001149 0.091667 0.0443872 0.1239288 -0.0229507 -0.0365948 -0.0210408 -0.0274665 0.003783 -0.0009381 -0.0916549 -0.0443435 -0.1238994 -0.0232171 0.0836661 0.0177285 -0.0000074 -0.0147273 -0.1234894 -0.0000106 0.0000041 -0.00001 0.1529627 0.0836675 -0.0177259 -0.0000081 0.0147333 -0.123488 -0.0000111 -0.0000015 -0.000008 0.1529629 -0.103307 -0.093725 -0.0000293 -0.0978181 0.0325888 -0.0000151 -0.0000319 -0.0000168 0.1599965 -0.1033141 0.0937206 -0.0000291 0.097813 0.0325955 0.0000102 -0.0000376 0.0000166 0.1599966 0.0090948 -0.058132 0.0000584 -0.1185512 -0.0719338 0.0000183 0.0000672 0.0000126 0.1890174 0.0090873 0.0581355 0.0000702 0.1185574 -0.0719316 -0.0000669 0.0000937 -0.0000607 0.189016 unknown
polarizability: 144.0880615|0.0004345|105.4159421|-0.0045851|0.0034811|49.6199961 unknown
InChI: InChI=1S/C10H10/c1-8-6-9-4-2-3-5-10(9)7-8/h2-5H,1,6-7H2
charge 0 multiplicity 1
20 atoms
C  1.262318 -1.258208 0.000196
C  1.262294 1.258249 0.000461
C  -0.159334 -0.70966 0.000069
C  -0.159363 0.709666 0.000151
C  2.149105 0.000032 -0.000032
C  -1.375181 -1.424527 -0.000095
C  -1.375232 1.424492 0.000026
C  -2.597186 -0.708293 -0.000206
C  -2.597211 0.708216 -0.000154
C  3.503689 0.000056 -0.000626
H  1.459412 -1.888088 0.889406
H  1.459461 -1.888423 -0.888757
H  1.45949 1.88879 -0.888242
H  1.459259 1.887816 0.889925
H  -1.379698 -2.521216 -0.000134
H  -1.379773 2.521181 0.00006
H  -3.549278 -1.251395 -0.000332
H  -3.549322 1.251285 -0.000273
H  4.078361 0.933744 -0.000786
H  4.078389 -0.933617 -0.000957
