program: Gaussian 09
title: 000144308
version: EM64L-G09RevD.01
frameworkgroup: C1[X(C10H9NOS)]
method: RPBEPBE
basis: SDD
operation: Freq
keyword: #p
keyword: freq=noraman
keyword: PBEPBE/SDD
title: #p freq=noraman PBEPBE/SDD
converged: NO YES NO NO
title: Mulliken charges:
elementType: S O N C C C C C C C C C C H H H H H H H H H
charge: 0.208278 -0.184848 -0.214947 -0.421055 -0.381358 -0.530852 0.455943 0.422522 -0.414612 -0.116365 -0.425612 -0.283025 -0.240656 0.230333 0.220194 0.260628 0.238208 0.235188 0.227210 0.237190 0.247337 0.230298
chargesum: 0.00000
title: Mulliken charges with hydrogens summed into heavy atoms:
elementType: S O N C C C C C C C C C C
charge: 0.208278 -0.184848 -0.214947 0.029473 0.117479 -0.068455 0.455943 0.422522 -0.414612 -0.116365 -0.188422 -0.035687 -0.010358
polarizability: 1.70890856e+02 -7.20254754e+00 1.50578120e+02 -4.55352763e-01 -3.26810177e+00 6.28036918e+01
1716.lowfreq: -9.3984 -4.5190 -0.0012 0.0020 0.0027 8.9096 108.4559 109.0467 154.0547
frequency: 108.4556 109.0398 154.0516 216.6218 276.9597 303.3189 320.1088 362.1954 397.8035 430.2979 452.0703 497.9287 520.4282 532.7743 540.1422 595.6700 614.2780 687.8218 735.0467 769.3114 804.8964 832.2609 867.8817 898.1265 900.6625 923.9163 965.1346 1017.6939 1049.1012 1075.2718 1085.1751 1157.8183 1162.2509 1191.1058 1198.0127 1220.3819 1243.2080 1289.2278 1307.6683 1330.3406 1348.8519 1373.0390 1397.1333 1443.0019 1455.8119 1467.2226 1473.1555 1490.8258 1594.7123 1609.6559 1670.9796 2971.0950 2991.4271 3007.9926 3044.5695 3071.2382 3081.4120 3128.6124 3150.0637 3170.3673
redmass: 9.3941 2.6206 4.0865 4.0128 5.3281 2.0495 5.3027 5.6099 10.0867 6.3484 3.5059 5.7429 4.9589 5.2803 4.3621 3.9198 4.4619 6.8982 4.4391 1.3020 5.6104 2.6703 1.5687 2.8540 1.3931 2.8748 1.3282 3.2455 2.2458 1.8923 2.1821 1.8088 1.3894 1.6923 1.4613 2.0730 1.4884 1.6419 2.3687 1.4207 1.4029 1.6664 7.7807 2.3551 1.3096 1.0983 1.9366 1.3535 7.7193 7.6840 12.4026 1.0658 1.0668 1.0616 1.0943 1.1000 1.1010 1.0880 1.0911 1.0984
irintensity: 1.3599 1.1085 3.0646 0.1794 4.4835 3.4134 2.7757 3.3949 9.8492 0.2885 6.7313 1.5744 6.1682 2.0447 0.9965 4.4400 1.6683 11.8190 15.3684 57.1373 25.1745 10.7071 9.7327 7.2576 0.9881 7.0896 1.0334 1.1178 6.4798 5.4471 10.2026 21.7187 28.2288 24.1043 1.6590 56.1191 1.4156 19.3295 26.0251 10.6862 0.3739 3.7191 0.7203 34.5888 15.5102 10.5117 16.5118 51.1475 17.1782 10.9170 569.7725 25.9792 31.3875 23.8192 28.5699 32.4726 17.8735 7.0847 11.3985 16.6197
temp: 298.150 k
press: 1.00000 atm
elementType: 16 8 7 6 6 6 6 6 6 6 6 6 6 1 1 1 1 1 1 1 1 1
symmnumber: 1
zpe: 443130.5 jmol-1
zpe.correction: 0.168779 hartree
zpe.thermalcorrener: 0.178859 hartree
zpe.thermalcorrenthalpy: 0.179803 hartree
zpe.thermalcorrgfe: 0.133245 hartree
zpe.sumelectzpe: -913.614954 hartree
zpe.sumelectthermal: -913.604874 hartree
zpe.sumelectthermalent: -913.603930 hartree
zpe.sumelectthermalfe: -913.650489 hartree
dipole: 4.6438 2.2393 -0.0814
dipole: 5.1561
quadrupole: -91.9879 -71.2739 -84.9283
quadrupole: -0.1133 -0.0235 -0.5617
quadrupole: -9.2579 11.4562 -2.1983 -0.1133 -0.0235 -0.5617
hfenergy: -913.7837332 hartree
pointgroup: C01 [X(C10H9N1O1S1)]
dipole: 1.4532939 1.4144418 -0.0492415 debye
dipolederiv: -0.5202405 0.1391525 -0.0133856 0.30245 -0.336409 0.0159725 -0.0170833 0.026532 0.0211769 -1.6694801 0.0078869 -0.0087961 0.1630626 -0.4513002 0.0092972 -0.0164686 0.0085956 -0.3075548 -1.164198 -0.0976954 -0.0191261 -0.253335 -0.8610245 0.0373474 0.0039128 -0.0095103 -0.1573934 0.056738 -0.0282169 -0.0030368 -0.0140064 0.0045104 -0.018157 -0.0256329 0.0108598 0.1145723 0.1321631 -0.189753 0.0206283 -0.1800389 0.5557138 -0.0648391 0.0622788 -0.0600616 0.2887339 0.0227597 -0.002837 0.0144956 0.0618375 0.0541791 0.0022664 0.0200073 0.0497299 0.1498708 0.6454652 -0.2209153 0.0159199 -0.3377251 -0.272184 0.0226074 0.0210757 0.0494494 0.0593808 -0.0330096 0.0612531 0.0187733 -0.0975133 0.2643472 -0.0289411 0.0449288 -0.0780546 -0.0570673 0.4219129 0.3048053 -0.0175962 0.4863666 0.0368531 -0.0093151 -0.0356336 -0.0083244 -0.1017068 2.1233997 -0.0201567 0.0172269 -0.0730069 1.1542874 -0.0650405 0.0121426 -0.074221 0.1458852 -0.0075171 0.0506791 -0.0027371 0.1008088 -0.037095 -0.0173183 -0.0122061 -0.0098695 -0.1745536 -0.0653063 -0.0516867 0.0048454 -0.1249438 0.0333547 -0.0092331 0.0091617 -0.011291 -0.1225532 -0.0183175 -0.025197 0.0079343 -0.0233083 -0.0202444 -0.0103337 0.0002708 -0.0041637 -0.1677098 0.0303306 -0.0202989 -0.0107901 -0.0203401 0.1028417 0.0586636 0.0075417 -0.0062215 -0.1376932 0.0446999 0.0726077 -0.0012354 0.0803123 -0.1757813 0.0105651 -0.0134136 0.0333959 0.0915557 -0.0511545 0.0590049 0.0542339 -0.0354429 0.0656058 0.0144279 0.0531887 -0.008877 0.0649116 0.0820012 0.0061157 -0.0034879 0.0297719 -0.04878 0.0189939 -0.0684504 0.0728762 -0.1275903 -0.0613163 -0.094376 -0.0632408 -0.0569578 -0.0277999 -0.0418511 -0.065878 -0.092117 0.0543123 0.0696005 0.06836 -0.0084516 0.0141593 -0.0276441 0.0517863 0.0254786 0.0910499 -0.1153811 -0.0220915 -0.0868669 0.0035379 -0.1224989 -0.0089134 0.0061436 0.0015162 0.0007184 0.1515288 0.0965721 0.0009891 -0.0003118 0.0431301 -0.0618724 0.0124134 -0.0010742 0.013837 0.1629472 -0.1130114 0.0671455 -0.0053999 0.0572184 0.057355 0.004544 -0.005663 0.0056675 0.164328 unknown
polarizability: 173.1823207|0.3527007|148.2126903|0.3997477|-4.1232053|62.8776563 unknown
InChI: InChI=1S/C10H9NOS/c12-10-11-6-2-4-7-3-1-5-8(13-10)9(7)11/h1,3,5H,2,4,6H2
charge 0 multiplicity 1
22 atoms
S  -1.110709 -2.391825 0.089687
O  -3.338024 -0.682846 -0.024027
N  -1.174619 0.279683 -0.081118
C  -0.542561 2.619567 0.429393
C  -1.606769 1.69321 -0.199729
C  0.863604 2.36944 -0.174842
C  0.192925 -0.057594 -0.052504
C  1.235804 0.895323 -0.095199
C  0.445233 -1.448914 0.032295
C  -2.092339 -0.76887 -0.016359
C  2.559095 0.401404 -0.052948
C  1.765208 -1.931548 0.066376
C  2.822258 -0.989104 0.02078
H  -0.513658 2.451039 1.522029
H  -0.849147 3.667782 0.261444
H  -2.58411 1.789173 0.301939
H  -1.750482 1.937359 -1.270539
H  1.61825 2.981863 0.351592
H  0.870975 2.702212 -1.233294
H  3.395018 1.110438 -0.075298
H  1.973142 -3.003718 0.129398
H  3.857706 -1.343874 0.049424
