program: Gaussian 09
title: 000144294
version: EM64L-G09RevD.01
frameworkgroup: C1[X(C9H14O4)]
method: RPBEPBE
basis: SDD
operation: Freq
keyword: #pfreq=noraman
keyword: PBEPBE/SDD
title: #p freq=noraman PBEPBE/SDD
converged: YES YES NO NO
title: Mulliken charges:
elementType: O O O O C C C C C C C C C H H H H H H H H H H H H H H
charge: -0.274907 -0.275190 -0.230161 -0.230671 -0.233476 -0.218067 -0.476926 -0.480570 -0.446638 0.210382 0.198976 -0.500535 -0.498224 0.300812 0.296293 0.256051 0.221809 0.256584 0.229530 0.223161 0.237313 0.242489 0.241858 0.233118 0.241809 0.233035 0.242148
chargesum: 0.00000
title: Mulliken charges with hydrogens summed into heavy atoms:
elementType: O O O O C C C C C C C C C
charge: -0.274907 -0.275190 -0.230161 -0.230671 0.067335 0.078226 0.000933 0.005544 0.013836 0.210382 0.198976 0.216929 0.218768
polarizability: 1.20623522e+02 4.52516551e-01 1.04926535e+02 -1.52098753e+00 2.20228462e-02 9.06756334e+01
1716.lowfreq: -11.3781 -10.2347 -4.4462 -0.0006 -0.0003 0.0007 10.4082 23.6442 30.6873
frequency: 7.2331 22.9771 30.4661 77.4692 92.1924 98.0163 103.0858 140.3446 175.0924 180.5404 231.9360 282.2189 316.1986 328.2348 402.5932 418.0200 544.1930 592.1790 612.5843 661.8408 725.0371 764.8117 779.9368 808.9110 833.6187 881.4429 901.4373 908.5905 931.8422 962.9006 987.8571 1070.9230 1072.3057 1083.2098 1112.2819 1113.0542 1123.7449 1125.2918 1146.3030 1148.4797 1165.4593 1180.8572 1212.9998 1228.5744 1246.7767 1276.6185 1295.5187 1311.8525 1317.7535 1331.5253 1421.1786 1421.8698 1451.6182 1452.2820 1461.2983 1464.1009 1464.3040 1471.3785 1486.5640 1635.1331 1636.0558 3004.4131 3004.7371 3007.7494 3010.3101 3021.8521 3029.9505 3037.1132 3065.0570 3087.4176 3096.0317 3106.1551 3106.6309 3148.7816 3148.9354
redmass: 3.1300 5.8836 4.5759 2.4771 1.1220 1.1974 2.4032 3.6983 3.6242 3.6450 3.0346 4.2180 4.2795 3.5874 6.1507 4.6040 5.0814 5.7745 2.7650 4.3676 4.0377 2.2336 3.2815 3.9097 2.4281 4.1467 2.6260 2.4708 2.7114 4.0746 2.9457 1.8610 2.2422 1.8691 1.2697 1.2711 1.9319 2.5253 1.4271 1.4420 3.4408 1.6455 1.4293 1.2080 1.2935 1.3256 1.3288 1.5064 1.4899 1.6276 1.1763 1.1782 1.0504 1.0501 1.0838 1.0509 1.0508 1.0803 1.0966 9.7274 9.8204 1.0297 1.0295 1.0611 1.0647 1.0686 1.0798 1.0802 1.1016 1.1012 1.1036 1.1045 1.1045 1.1049 1.1049
irintensity: 0.5227 1.1450 1.2897 0.1078 0.4236 0.4352 0.9356 0.8758 4.1925 5.5221 10.3046 10.4785 18.7520 12.8420 0.1747 4.7472 0.8680 6.0531 3.7307 10.1204 2.2890 8.8483 13.2333 9.6431 7.5488 3.1414 14.7722 5.5362 16.2611 26.0006 19.7756 24.6225 7.8821 22.9320 1.5592 2.0489 119.4373 250.6807 10.7039 2.2174 121.7619 83.7124 7.3033 3.8525 19.9785 10.3925 8.0181 12.1497 5.9605 7.7367 17.7983 13.7777 13.1397 13.3213 16.8772 8.5540 13.5410 10.6234 20.8387 108.5723 219.0597 51.7330 23.1908 19.2707 32.5390 39.4427 17.8151 3.3331 10.7136 8.0157 34.9469 25.1056 25.3634 14.5395 15.8569
temp: 298.150 k
press: 1.00000 atm
elementType: 8 8 8 8 6 6 6 6 6 6 6 6 6 1 1 1 1 1 1 1 1 1 1 1 1 1 1
symmnumber: 1
zpe: 577845.7 jmol-1
zpe.correction: 0.220090 hartree
zpe.thermalcorrener: 0.234575 hartree
zpe.thermalcorrenthalpy: 0.235519 hartree
zpe.thermalcorrgfe: 0.174519 hartree
zpe.sumelectzpe: -651.229854 hartree
zpe.sumelectthermal: -651.215369 hartree
zpe.sumelectthermalent: -651.214425 hartree
zpe.sumelectthermalfe: -651.275425 hartree
dipole: 0.0050 -2.3589 -0.0852
dipole: 2.3604
quadrupole: -75.8945 -73.1979 -76.8440
quadrupole: 0.4164 -11.9140 0.2203
quadrupole: -0.5824 2.1142 -1.5319 0.4164 -11.9140 0.2203
hfenergy: -651.4499442 hartree
pointgroup: C01 [X(C9H14O4)]
dipole: -0.103101 -0.9220321 -0.0405268 debye
polarizability: 119.6371348|-1.113241|104.9941149|-5.3411276|0.6465106|91.5944405 unknown
InChI: InChI=1S/C9H14O4/c1-12-8(10)6-4-3-5-7(6)9(11)13-2/h6-7H,3-5H2,1-2H3
charge 0 multiplicity 1
27 atoms
O  1.783944 -1.53821 -0.74686
O  -2.142139 -1.083337 0.672153
O  2.97431 -0.037805 0.568657
O  -2.912236 0.77113 -0.494805
C  0.490127 0.001873 0.602076
C  -0.500786 0.161871 -0.596331
C  0.553665 1.426994 1.201818
C  -0.197288 1.576463 -1.174129
C  0.536491 2.368229 -0.037714
C  1.874446 -0.476583 0.161995
C  -1.960522 0.032131 -0.155136
C  3.07597 -2.126391 -1.176711
C  -3.53777 -1.342823 1.10187
H  0.110025 -0.750361 1.317774
H  -0.331202 -0.64011 -1.338396
H  1.448774 1.569752 1.828788
H  -0.341395 1.592549 1.830058
H  -1.135649 2.066286 -1.482795
H  0.444093 1.488161 -2.068328
H  0.031521 3.323342 0.187125
H  1.572119 2.606447 -0.339288
H  3.625159 -2.517872 -0.303971
H  3.694876 -1.364095 -1.679069
H  2.800286 -2.934532 -1.868446
H  -3.928716 -0.482695 1.670917
H  -3.475204 -2.241688 1.731004
H  -4.180897 -1.514925 0.222545
