program: Gaussian 09
title: 000144285
version: EM64L-G09RevD.01
frameworkgroup: C1[X(C8H10)]
method: RPBEPBE
basis: SDD
operation: Freq
keyword: #p
keyword: freq=noraman
keyword: PBEPBE/SDD
title: #p freq=noraman PBEPBE/SDD
converged: YES YES NO NO
title: Mulliken charges:
elementType: C C C C C C C C H H H H H H H H H H
charge: -0.479878 -0.479876 -0.474673 -0.474675 -0.140374 -0.140375 0.012745 0.012751 0.219446 0.207270 0.207269 0.219447 0.227046 0.227655 0.227658 0.227045 0.200759 0.200759
chargesum: 0.00000
title: Mulliken charges with hydrogens summed into heavy atoms:
elementType: C C C C C C C C
charge: -0.053162 -0.053160 -0.019972 -0.019972 0.060386 0.060384 0.012745 0.012751
polarizability: 1.07386161e+02 1.05743305e-04 6.88681488e+01 -2.69007988e-04 -2.14571905e+00 5.66129750e+01
1716.lowfreq: -16.0293 -6.7432 -0.0007 -0.0002 -0.0002 12.2204 174.8886 188.9262 238.9837
frequency: 174.8809 188.9222 238.9732 266.3360 305.1742 324.0730 459.0438 495.8345 544.9634 582.5395 712.1557 751.7205 796.7867 846.9064 889.7927 907.0453 962.4913 964.4756 995.2219 1007.2807 1054.5979 1139.2065 1147.8341 1169.0936 1187.2345 1200.3967 1277.3170 1285.0465 1287.7529 1314.6552 1322.0522 1390.5663 1457.0002 1459.7570 1460.0464 1468.6079 1656.7445 2239.5190 2979.9111 2980.6938 2985.8818 2987.2335 3033.7647 3035.1452 3045.3238 3047.3624 3068.3103 3101.2073
redmass: 2.3120 2.5275 4.4118 2.4750 2.3172 3.3570 4.6078 2.5852 2.9496 2.2762 1.6485 2.8670 2.3007 2.1132 1.9910 1.9004 2.9595 1.3552 2.5003 1.7817 1.8470 2.9450 1.1016 1.2502 1.1812 1.3018 1.2404 1.1881 1.1481 1.4334 1.3687 1.3956 1.0943 1.0915 1.1031 1.0940 6.9826 11.5500 1.0579 1.0582 1.0607 1.0608 1.1006 1.1005 1.1002 1.1028 1.0874 1.0967
irintensity: 0.3605 6.3741 1.7517 4.0866 6.5343 1.5088 9.9560 1.3614 11.8479 1.5272 39.9980 35.1758 1.0802 1.2575 1.2753 5.5607 0.0664 0.4451 8.5275 4.6421 0.0743 0.1372 0.5949 6.2629 2.8606 2.3030 3.6019 0.9107 0.1418 6.9840 0.4256 0.3906 0.7494 4.5925 8.2283 23.4880 2.7572 10.2727 58.6474 0.7572 125.4784 3.4019 42.6412 13.7266 5.2428 38.5690 23.4617 72.1396
temp: 298.150 k
press: 1.00000 atm
elementType: 6 6 6 6 6 6 6 6 1 1 1 1 1 1 1 1 1 1
symmnumber: 1
zpe: 401926.6 jmol-1
zpe.correction: 0.153086 hartree
zpe.thermalcorrener: 0.160544 hartree
zpe.thermalcorrenthalpy: 0.161488 hartree
zpe.thermalcorrgfe: 0.121953 hartree
zpe.sumelectzpe: -310.146520 hartree
zpe.sumelectthermal: -310.139062 hartree
zpe.sumelectthermalent: -310.138118 hartree
zpe.sumelectthermalfe: -310.177652 hartree
dipole: 0.0000 1.3837 0.3331
dipole: 1.4233
quadrupole: -40.3353 -53.8371 -48.1821
quadrupole: -0.0001 0.0000 -2.1891
quadrupole: 7.1162 -6.3856 -0.7306 -0.0001 0.0000 -2.1891
hfenergy: -310.2996053 hartree
pointgroup: C01 [X(C8H10)]
dipole: 0.000018 -0.5469492 -0.1199613 debye
dipolederiv: 0.0205835 0.0239265 -0.0444462 0.1194811 0.072694 0.0397952 0.0582629 0.0712821 0.0977955 0.0205901 -0.0239338 0.0444428 -0.1194851 0.0726872 0.0397961 -0.0582696 0.0712792 0.0977938 0.311827 0.0532766 0.0056212 -0.0971384 0.1193346 -0.0321231 -0.0753868 -0.012817 0.186679 0.3118114 -0.0532704 -0.0056151 0.097136 0.1193364 -0.032124 0.075414 -0.012812 0.1866765 0.0291398 -0.0707952 -0.0137493 -0.0979446 -0.0800099 -0.1993515 0.0300918 -0.2609192 -0.0122249 0.0291346 0.0708017 0.0137558 0.0979481 -0.0800004 -0.1993514 -0.0300825 -0.260922 -0.0122263 -0.1585681 0.2882592 0.032447 0.3513724 -0.2022952 -0.0206061 0.0374547 -0.0156414 -0.1634151 -0.1585358 -0.288255 -0.0324458 -0.3513597 -0.2022934 -0.0206114 -0.0374773 -0.0156786 -0.1634133 0.0398088 0.0299218 0.1147407 0.0269298 0.0484238 0.0452212 0.0294191 0.0181674 -0.1168473 -0.1480238 -0.0989407 -0.0506603 -0.1576583 -0.0472549 -0.0319406 -0.0472707 -0.0071642 0.0840057 -0.1480328 0.0989374 0.0506618 0.1576551 -0.0472454 -0.031939 0.047274 -0.0071643 0.0840052 0.039811 -0.0299197 -0.1147417 -0.0269281 0.048421 0.0452187 -0.0294191 0.0181683 -0.1168446 -0.0111625 -0.0128828 0.0770443 -0.0756832 0.0616874 0.0051335 0.1325419 -0.0216195 -0.0784581 -0.0720662 0.0584683 -0.0789958 0.0985282 -0.0108917 0.0596995 -0.1359263 0.0591989 0.0182173 -0.0720588 -0.0584716 0.0789896 -0.0985295 -0.0108991 0.0597026 0.1359199 0.0592049 0.0182207 -0.0111618 0.0128811 -0.0770454 0.0756782 0.0616906 0.0051317 -0.1325402 -0.0216215 -0.0784573 -0.0115469 -0.0620988 0.0643528 -0.0339738 0.0383063 0.1341752 0.0470883 0.16953 -0.0157532 -0.0115494 0.0620953 -0.0643563 0.0339719 0.0383088 0.1341734 -0.0470938 0.1695291 -0.0157536 unknown
polarizability: 107.3861607|0.0004793|68.7759132|0.0006497|-2.3928991|56.7052106 unknown
InChI: InChI=1S/C8H10/c1-2-4-6-8-7-5-3-1/h1-2H,3-6H2
charge 0 multiplicity 1
18 atoms
C  -1.640746 -0.699886 -0.525384
C  1.640811 -0.699827 -0.525373
C  -1.940999 0.74539 0.027622
C  1.941012 0.745453 0.027652
C  -0.683081 -1.491024 0.363742
C  0.683171 -1.4910 0.363746
C  -0.61847 1.398828 0.14056
C  0.618452 1.398834 0.1406
H  -1.213562 -0.579984 -1.539411
H  -2.595442 -1.252034 -0.626926
H  2.595526 -1.251944 -0.626919
H  1.213624 -0.579925 -1.539397
H  -2.441102 0.687084 1.014084
H  -2.628918 1.2747 -0.658538
H  2.628898 1.274806 -0.658507
H  2.441121 0.687156 1.014108
H  -1.172084 -2.120531 1.123716
H  1.172186 -2.120495 1.123723
