program: Gaussian 09
title: 000144248
version: EM64L-G09RevD.01
frameworkgroup: C1[X(C11H18O)]
method: RPBEPBE
basis: SDD
operation: Freq
keyword: #pfreq=noraman
keyword: PBEPBE/SDD
title: #p freq=noraman PBEPBE/SDD
converged: NO YES NO NO
title: Mulliken charges:
elementType: O C C C C C C C C C C C H H H H H H H H H H H H H H H H H H
charge: -0.470343 0.332455 0.224587 -0.501067 -0.506840 -0.502251 -0.415964 -0.403802 -0.760542 -0.261995 -0.474388 -0.191596 0.194325 0.207685 0.215857 0.207158 0.217444 0.226106 0.204744 0.205939 0.216623 0.177610 0.239048 0.225130 0.195528 0.243615 0.211182 0.224402 0.201338 0.318012
chargesum: 0.00000
title: Mulliken charges with hydrogens summed into heavy atoms:
elementType: O C C C C C C C C C C C
charge: -0.152331 0.332455 0.224587 -0.099056 -0.083825 -0.058700 -0.005281 -0.009569 -0.100836 -0.018380 -0.038804 0.009742
polarizability: 1.28903180e+02 -2.85776050e+00 1.09612245e+02 -4.72452668e+00 1.71364785e+00 1.01030361e+02
1716.lowfreq: -26.2784 -0.0009 -0.0009 -0.0005 0.7335 17.0904 113.4756 162.9138 169.6019
frequency: 113.3906 162.8809 169.5465 193.5826 228.9477 235.1714 251.7949 291.4930 312.4907 340.2461 361.2290 413.4850 422.5145 439.8999 469.7532 494.9221 532.4925 560.1287 619.4621 696.0684 724.9865 765.8588 796.2340 841.1293 865.2886 882.6714 906.4702 911.8761 933.6801 962.0351 971.0373 983.9927 995.1825 1013.5537 1043.0062 1058.4722 1083.0228 1102.5945 1108.0146 1131.5002 1150.1511 1162.3907 1202.1671 1206.7901 1225.7425 1242.5404 1269.7389 1277.4919 1296.6556 1320.0313 1328.3223 1334.8544 1337.7462 1341.5728 1352.5449 1380.3498 1385.1102 1447.1660 1452.8119 1459.0215 1463.7616 1469.1584 1474.4084 1478.8667 1489.7567 1676.2974 2943.3637 2946.7933 2956.4117 2977.0693 2979.9637 2981.7746 2993.2123 3001.5627 3011.2454 3027.3838 3035.4376 3039.0501 3053.9954 3075.3609 3092.7441 3098.5923 3133.3324 3548.5200
redmass: 2.4360 1.7633 2.0842 1.6817 2.1313 1.1686 2.6794 2.8113 1.9923 2.4462 2.3005 2.8851 3.0018 2.8508 3.1799 2.3756 2.9992 2.2673 3.8407 1.6066 2.5546 1.6644 1.7460 2.3299 2.4036 1.8323 2.3844 1.8375 2.0004 1.8397 1.4796 1.6713 1.8801 1.9597 1.5948 2.2962 1.3764 1.6490 2.5528 1.5799 1.9186 1.3155 1.6969 1.6207 1.3629 1.4799 1.3607 1.3329 1.7945 1.4291 1.4239 1.4292 1.4997 1.5333 1.5740 1.4881 1.3916 1.0829 1.0672 1.0805 1.0759 1.0796 1.0879 1.0881 1.0565 7.1745 1.0640 1.0670 1.0625 1.0593 1.0591 1.0451 1.0614 1.0943 1.0939 1.0913 1.1023 1.1013 1.1016 1.0971 1.0987 1.0847 1.0983 1.0651
irintensity: 0.8085 1.2751 3.8058 16.4633 21.8886 72.3002 4.4593 4.7698 1.0899 0.8817 3.8138 4.8378 0.8078 4.4155 3.0552 6.5107 1.1702 9.0635 1.1228 27.6019 8.7400 0.7802 3.5356 5.9683 6.3150 9.9266 15.9306 4.2875 25.7520 18.3092 5.0858 1.8080 10.7782 3.6474 25.7583 8.8138 8.0354 7.1632 3.7958 17.0806 5.9104 3.2876 2.1958 1.5685 9.0863 14.8345 2.4900 7.2763 6.2223 0.1598 3.0695 0.9734 0.3775 1.9725 7.8513 6.6615 15.9706 6.2249 3.1490 15.0732 9.4259 11.1791 19.1446 9.5881 8.8559 3.2204 29.4813 49.7669 34.9797 4.9115 42.1398 44.8625 16.5844 31.7600 56.0789 64.9097 34.0576 65.9961 46.3654 28.4559 29.0442 12.5287 36.2687 1.4590
temp: 298.150 k
press: 1.00000 atm
elementType: 8 6 6 6 6 6 6 6 6 6 6 6 1 1 1 1 1 1 1 1 1 1 1 1 1 1 1 1 1 1
symmnumber: 1
zpe: 696892.7 jmol-1
zpe.correction: 0.265432 hartree
zpe.thermalcorrener: 0.277046 hartree
zpe.thermalcorrenthalpy: 0.277990 hartree
zpe.thermalcorrgfe: 0.229807 hartree
zpe.sumelectzpe: -504.223359 hartree
zpe.sumelectthermal: -504.211746 hartree
zpe.sumelectthermalent: -504.210802 hartree
zpe.sumelectthermalfe: -504.258985 hartree
dipole: -1.0123 -1.4180 -1.4735
dipole: 2.2818
quadrupole: -69.4883 -75.9996 -76.9648
quadrupole: -1.2565 -2.9219 -2.1607
quadrupole: 4.6626 -1.8487 -2.8139 -1.2565 -2.9219 -2.1607
hfenergy: -504.4887918 hartree
pointgroup: C01[X(C11H18O1)]
dipole: -0.4125405 0.5016824 0.6197048 debye
polarizability: 128.7626593|3.3552242|109.5890047|4.5134014|2.4266898|101.1941222 unknown
InChI: InChI=1S/C11H18O/c1-10-6-2-4-8-11(10,12)9-5-3-7-10/h4,8,12H,2-3,5-7,9H2,1H3
charge 0 multiplicity 1
30 atoms
O  -0.450681 -1.316998 -1.667014
C  0.030036 0.796375 -0.362988
C  -0.016156 -0.779494 -0.343077
C  -1.415387 1.387202 -0.349728
C  0.824814 1.272073 0.894039
C  -0.988907 -1.331032 0.748459
C  -2.343144 0.818891 0.748832
C  -2.407403 -0.722574 0.663843
C  0.74012 1.306828 -1.643656
C  1.364096 -1.370338 -0.128971
C  2.278999 0.736382 0.933463
C  2.382176 -0.705439 0.472736
H  -1.886301 1.20056 -1.339486
H  -1.341952 2.489129 -0.25492
H  0.300752 0.950292 1.813476
H  0.835035 2.380229 0.909513
H  -0.567226 -1.124451 1.750088
H  -1.027037 -2.431309 0.637306
H  -3.355356 1.255176 0.643287
H  -1.976329 1.113749 1.752053
H  -3.036262 -1.134585 1.476124
H  -2.903925 -1.021845 -0.285186
H  1.760819 0.900168 -1.739375
H  0.185314 1.000834 -2.547002
H  0.802613 2.412034 -1.625996
H  1.486343 -2.404542 -0.475418
H  2.688721 0.83596 1.958847
H  2.93638 1.360128 0.291222
H  3.348842 -1.20948 0.612292
H  -1.401592 -1.070222 -1.801463
