program: Gaussian 09
title: 000144244
version: EM64L-G09RevD.01
frameworkgroup: C1[X(C4H7NO2)]
method: RPBEPBE
basis: SDD
operation: Freq
keyword: #pfreq=noraman
keyword: PBEPBE/SDD
title: #p freq=noraman PBEPBE/SDD
converged: YES YES NO NO
title: Mulliken charges:
elementType: O O N C C C C H H H H H H H
charge: -0.226012 -0.125397 0.144729 -0.454175 -0.298718 -0.019075 -0.563254 0.230784 0.206805 0.229878 0.215912 0.215883 0.220196 0.222444
chargesum: 0.00000
title: Mulliken charges with hydrogens summed into heavy atoms:
elementType: O O N C C C C
charge: -0.226012 -0.125397 0.144729 -0.016587 0.147072 0.196808 -0.120614
polarizability: 6.45770704e+01 -6.32202582e+00 7.24786608e+01 2.21964389e+00 2.93457332e+00 4.69643696e+01
1716.lowfreq: -19.1825 -8.3886 -3.4728 -0.0005 0.0006 0.0008 45.0620 70.3682 99.7833
frequency: 44.9453 70.1773 99.7563 190.0602 265.8219 311.5451 381.8767 429.4129 508.8568 630.3754 743.5452 824.2693 878.4888 953.1466 965.6867 977.6069 1001.5867 1031.9296 1139.5209 1219.7866 1230.1747 1289.2234 1319.2973 1338.1396 1423.9661 1446.9098 1450.5666 1539.8019 1657.7041 2972.7543 2997.5902 3052.4100 3076.2395 3083.5244 3097.7955 3200.3809
redmass: 5.4265 2.5533 3.4039 9.5971 3.2307 2.4558 2.4724 2.3950 4.7625 1.4544 6.6128 2.3806 2.0543 1.4420 1.7442 1.6923 1.2458 2.9655 1.8943 1.2746 1.2241 1.2120 1.3195 1.2337 1.1517 1.0927 1.1220 13.9003 4.6706 1.0635 1.0605 1.0951 1.1025 1.0750 1.0813 1.1148
irintensity: 0.0546 0.7357 1.9842 0.3024 0.8187 3.7554 5.3848 8.4770 20.1266 16.4347 212.7061 4.3513 7.9879 50.7232 30.3915 30.1506 5.0158 12.3015 4.1241 5.4104 10.2248 0.6882 2.1481 7.7423 6.4586 23.6474 2.0315 261.7619 7.6634 24.5125 44.5727 11.0681 14.4404 33.8644 7.3152 23.5598
temp: 298.150 k
press: 1.00000 atm
elementType: 8 8 7 6 6 6 6 1 1 1 1 1 1 1
symmnumber: 1
zpe: 280194.6 jmol-1
zpe.correction: 0.106720 hartree
zpe.thermalcorrener: 0.114876 hartree
zpe.thermalcorrenthalpy: 0.115820 hartree
zpe.thermalcorrgfe: 0.073116 hartree
zpe.sumelectzpe: -361.154273 hartree
zpe.sumelectthermal: -361.146118 hartree
zpe.sumelectthermalent: -361.145174 hartree
zpe.sumelectthermalfe: -361.187877 hartree
dipole: -2.3288 1.6592 0.9945
dipole: 3.0274
quadrupole: -46.6164 -37.9690 -40.5901
quadrupole: 1.2116 1.6301 1.0424
quadrupole: -4.8913 3.7562 1.1351 1.2116 1.6301 1.0424
hfenergy: -361.2609935 hartree
pointgroup: C01[X(C4H7N1O2)]
dipole: -0.8198766 0.8115869 0.2962241 debye
dipolederiv: -0.4966658 0.2270644 -0.033235 0.3845402 -0.8470085 0.1562264 -0.3398559 0.5162112 -0.4583495 -0.6552889 0.6045454 -0.138323 0.7126301 -0.7931502 0.2274856 0.3746519 -0.324476 -0.1059846 0.7578182 -0.7383145 0.1693465 -0.9917764 1.2374828 -0.4206305 -0.0131528 -0.2624797 0.3262079 0.0425671 -0.0658591 -0.0110177 -0.0268912 -0.0390413 0.0514128 0.0086648 -0.0569497 0.0721115 0.4801242 -0.1478671 0.0321935 -0.1286208 0.4487742 -0.0139841 -0.0633791 0.2160297 0.2253196 -0.3002243 0.1036673 -0.0125777 0.0541761 0.1271152 -0.0107313 -0.1381997 -0.0494981 0.1567705 -0.3686053 0.0637666 -0.0319591 0.1292693 -0.1305626 -0.0442417 0.0200694 -0.0486228 0.0976372 0.0696661 -0.0398673 -0.010073 -0.0530703 0.0664314 -0.055447 -0.0230246 0.0093312 -0.1230455 -0.0305033 0.1179354 0.0205699 0.0691078 -0.1111685 -0.028663 0.0628873 -0.0248285 0.0902045 -0.0062133 -0.0383001 0.019173 -0.0204788 -0.1346574 0.0632236 0.0604926 0.0738863 0.0679805 0.0214114 0.0387083 -0.0307995 0.0425734 0.0712741 0.0164525 -0.0080865 -0.1115134 -0.1201407 0.1446327 -0.0281698 -0.0191229 -0.0458453 0.0424911 -0.0279009 0.0193857 0.0011995 -0.1369375 0.1734241 -0.0733728 0.0335273 -0.1024226 -0.0253525 0.0775659 0.0416047 0.0881702 0.0189513 0.1678572 -0.0239368 0.0122978 -0.0231914 0.0873722 0.0092317 -0.0020578 -0.0264597 -0.1107251 unknown
polarizability: 63.127828|-4.7071873|74.2061638|3.067161|-0.8997322|46.6861089 unknown
InChI: InChI=1S/C4H7NO2/c1-2-3-4-7-5-6/h2H,1,3-4H2
charge 0 multiplicity 1
14 atoms
O  1.029661 0.490464 -0.599445
O  2.10745 -1.423151 0.044295
N  1.372084 -0.549088 0.491513
C  -1.383155 1.057441 -0.330954
C  0.076816 1.464504 -0.02814
C  -1.831764 -0.153136 0.459399
C  -2.231774 -1.330681 -0.083008
H  -1.487593 0.872751 -1.415664
H  -2.023911 1.929194 -0.081313
H  0.328229 2.426817 -0.507856
H  0.251884 1.542213 1.062368
H  -1.815957 -0.045934 1.55526
H  -2.545806 -2.174188 0.541943
H  -2.250966 -1.485006 -1.168898
