program: Gaussian 09
title: 000144223
version: EM64L-G09RevD.01
frameworkgroup: C1[X(C8H6F3NO2)]
method: RPBEPBE
basis: SDD
operation: Freq
keyword: #p
keyword: freq=noraman
keyword: PBEPBE/SDD
title: #p freq=noraman PBEPBE/SDD
converged: NO YES YES YES
title: Mulliken charges:
elementType: F F F O O N C C C C C C C C H H H H H H
charge: -0.158475 -0.159868 -0.159897 -0.199442 -0.191337 0.026800 0.406729 0.316622 -0.471969 0.216499 -0.371201 -0.339310 -0.765260 0.264483 0.271033 0.278457 0.297412 0.259393 0.259372 0.219959
chargesum: 0.00000
title: Mulliken charges with hydrogens summed into heavy atoms:
elementType: F F F O O N C C C C C C C C
charge: -0.158475 -0.159868 -0.159897 -0.199442 -0.191337 0.026800 0.406729 0.316622 -0.200936 0.216499 -0.092744 -0.041898 -0.026536 0.264483
polarizability: 1.42953671e+02 -1.62222497e+00 1.17841024e+02 2.05347509e-04 1.04299802e-04 5.11433665e+01
1716.lowfreq: -17.6412 -10.9586 -5.6827 -0.0006 0.0002 0.0008 5.3549 7.6911 68.0354
frequency: -17.5448 -10.5980 68.0344 137.6826 153.3279 220.9907 238.0753 244.5846 265.9899 322.6856 338.4584 384.4449 433.0140 437.2314 468.6431 488.5744 551.6116 563.0174 587.8392 626.4577 673.7963 693.1017 738.2160 764.1829 859.7215 868.7818 893.3327 989.5596 997.2103 1000.9968 1021.3975 1041.5860 1054.3360 1073.6351 1161.0301 1187.2678 1206.7042 1268.8251 1301.3686 1360.3590 1376.1257 1407.7142 1422.1821 1454.4208 1462.9047 1481.0979 1589.8265 1621.2248 3000.3958 3085.5492 3103.3852 3155.4896 3176.7458 3194.1083
redmass: 6.2644 14.6832 9.7027 9.9821 4.5904 1.6473 1.7950 10.8205 10.3294 4.9405 7.9698 6.3225 3.8801 7.7332 5.5313 10.6771 6.0065 5.5048 5.6387 12.3742 4.1436 7.9892 4.7675 9.5708 1.4083 6.8033 1.4165 2.5767 2.2319 1.6698 6.4383 1.5609 4.3429 3.8637 1.5399 2.4166 5.6958 1.7884 2.6498 4.5512 4.1666 1.5433 3.4473 1.0452 1.7075 1.5913 7.4645 6.5054 1.0366 1.0960 1.1016 1.0925 1.0893 1.0970
irintensity: 0.2268 0.1166 4.4304 5.0368 1.2819 0.8965 0.0602 2.3743 1.1429 0.0699 0.2165 2.5543 1.3525 13.0458 3.9577 2.8298 0.5056 1.8779 0.0976 3.6434 17.3142 3.1065 2.7276 22.2301 60.2452 68.0663 24.4541 106.7747 99.3470 13.0965 183.6535 16.0001 22.0367 80.0012 4.3171 233.8779 94.0044 53.3056 160.0317 56.7081 78.4759 28.8291 33.1878 14.1779 38.2351 0.5298 6.2939 3.3175 6.7413 4.7556 23.3197 1.2323 1.7822 2.2592
temp: 298.150 k
press: 1.00000 atm
elementType: 9 9 9 8 8 7 6 6 6 6 6 6 6 6 1 1 1 1 1 1
symmnumber: 1
zpe: 342235.1 jmol-1
zpe.correction: 0.130350 hartree
zpe.thermalcorrener: 0.141055 hartree
zpe.thermalcorrenthalpy: 0.141999 hartree
zpe.thermalcorrgfe: 0.093649 hartree
zpe.sumelectzpe: -812.079920 hartree
zpe.sumelectthermal: -812.069215 hartree
zpe.sumelectthermalent: -812.068271 hartree
zpe.sumelectthermalfe: -812.116622 hartree
dipole: 0.7927 0.9048 -0.0004
dipole: 1.2029
quadrupole: -106.4638 -72.2885 -80.2836
quadrupole: -5.0324 -0.0015 0.0013
quadrupole: -20.1185 14.0568 6.0617 -5.0324 -0.0015 0.0013
hfenergy: -812.2102705 hartree
pointgroup: C01 [X(C8H6F3N1O2)]
dipole: -0.3111764 -0.3565769 -0.0000951 debye
dipolederiv: -0.613473 0.2474222 0.0000813 0.2122463 -0.655756 0.0000615 0.0001436 0.0000105 -0.2836006 -0.6552238 -0.1042317 -0.1768517 -0.179911 -0.3821444 -0.2157855 -0.1937516 -0.1810228 -0.627475 -0.6549934 -0.1039163 0.1769465 -0.1795556 -0.3818986 0.21581 0.1940041 0.1810075 -0.6281472 -0.643423 -0.2184981 0.0001227 -0.1835296 -0.7415778 -0.0001528 0.0001681 -0.000057 -0.2254482 -0.6863063 0.1777724 0.0003221 0.1304926 -0.613791 -0.0002298 0.0002889 -0.0003158 -0.2050367 1.6107702 0.1431106 -0.0006954 0.1184835 1.1514861 0.000398 -0.0006497 0.0003508 0.1861194 0.1669633 -0.4006184 -0.0001667 0.027917 0.270298 0.0000352 -0.0000553 0.0002546 0.0282143 -0.3326054 -0.00318 0.0000796 0.0756006 0.145725 0.0000144 -0.0000661 0.0000455 -0.1252433 -0.1419556 0.361507 0.0000995 0.047399 -0.0825511 -0.00002 0.0000562 -0.0001588 -0.1124621 -0.5439676 -0.1056546 0.0002949 0.000764 -0.008275 -0.0000495 0.0002741 0.0000099 0.0360094 -0.1470746 -0.2488386 -0.0000353 -0.0464294 -0.0604775 0.0000327 0.0000364 0.0001314 -0.1140407 0.0947428 0.2073144 -0.000041 -0.1511704 -0.1045693 0.0000664 -0.0001716 -0.0001163 -0.0812388 0.0019865 0.2888978 0.000083 0.1082125 -0.0882531 -0.000072 0.0000509 -0.0001253 0.0159315 2.1941031 -0.0287671 -0.000293 0.1059093 1.3513441 -0.0000763 -0.0004177 -0.0000162 1.5473382 0.0742877 -0.0348572 0.0000325 -0.0606637 -0.001127 -0.0000002 0.0000267 -0.0000256 0.1472433 0.076661 0.0455436 0.0000517 0.048169 0.0381853 -0.0000495 0.0000612 -0.0000393 0.1617655 0.1223684 -0.0483043 0.0000131 -0.0133165 0.0743795 -0.0000084 0.0000237 0.0000006 0.1692767 0.0493019 0.0036321 0.0835312 -0.0015477 0.0667149 0.0170547 0.0798611 -0.009328 0.0014376 0.0491324 0.0036748 -0.0835731 -0.0015087 0.0666942 -0.0170073 -0.0799218 0.0093584 0.0015326 -0.0212948 -0.1820086 -0.0000019 -0.0575612 -0.0444062 -0.0000215 0.0000389 0.0000361 0.1078241 unknown
polarizability: 142.9599877|-1.5723451|117.8346776|-0.0484427|0.0177257|51.1433963 unknown
InChI: InChI=1S/C8H6F3NO2/c1-5-4-6(8(9,10)11)2-3-7(5)12(13)14/h2-4H,1H3
charge 0 multiplicity 1
20 atoms
F  -3.411694 1.279328 0.001147
F  -3.253565 -0.682694 -1.129461
F  -3.252402 -0.681894 1.132972
O  3.471189 1.638947 -0.001403
O  3.759011 -0.615326 -0.00251
N  3.007543 0.433642 -0.001586
C  0.917042 -1.034606 -0.000954
C  -1.264776 0.136902 0.000402
C  -0.501371 -1.050388 -0.000231
C  1.524348 0.258729 -0.000954
C  -0.634328 1.400125 0.000341
C  0.768376 1.454113 -0.000343
C  1.651062 -2.35977 -0.00164
C  -2.766633 0.025373 0.001212
H  -1.012644 -2.018441 -0.000187
H  -1.227303 2.31799 0.000814
H  1.300594 2.408075 -0.000392
H  2.310947 -2.458972 -0.880292
H  2.311645 -2.459487 0.876441
H  0.927058 -3.191245 -0.001575
