program: Gaussian 09
title: 000144222
version: EM64L-G09RevD.01
frameworkgroup: C1[X(C9H14N2)]
method: RPBEPBE
basis: SDD
operation: Freq
keyword: #pfreq=noraman
keyword: PBEPBE/SDD
title: #p freq=noraman PBEPBE/SDD
converged: NO YES NO NO
title: Mulliken charges:
elementType: N N C C C C C C C C C H H H H H H H H H H H H H H
charge: -0.064256 -0.073010 -0.185268 -0.205153 -0.232902 -0.196621 -0.531002 -0.288143 -0.281880 -0.621389 -0.609542 0.241965 0.258836 0.263065 0.249616 0.241120 0.245581 0.245014 0.244905 0.217565 0.226163 0.209118 0.214386 0.229725 0.202106
chargesum: 0.00000
title: Mulliken charges with hydrogens summed into heavy atoms:
elementType: N N C C C C C C C C C
charge: -0.064256 -0.073010 0.056697 0.053683 0.030163 0.052995 -0.044301 -0.043129 -0.036975 0.031458 0.036675
polarizability: 1.18419192e+02 -5.92976986e-01 1.02839500e+02 2.55033968e+00 4.90810289e+00 8.42419922e+01
1716.lowfreq: -13.8097 -8.6696 0.0004 0.0009 0.0010 12.7797 119.6905 193.3916 206.2262
frequency: 119.6609 193.3873 206.2229 217.1924 239.5849 268.6897 313.3366 342.5484 387.6455 422.6153 485.8780 514.2051 580.6104 648.1193 708.8981 726.3567 778.1941 833.3748 840.3479 855.9175 875.6017 881.4350 922.9767 930.5752 959.9568 988.2631 1003.1233 1005.4258 1023.4410 1053.7032 1075.3699 1083.6902 1106.2841 1115.4728 1121.6369 1145.7070 1161.4537 1177.1041 1185.6569 1200.1044 1212.8293 1237.3976 1253.1112 1268.4962 1273.2510 1281.9776 1293.9358 1412.4524 1422.0064 1450.0337 1454.2147 1464.6042 1479.1038 1490.9630 1551.1970 2926.3054 2934.0900 3036.5913 3041.3514 3053.8157 3055.0619 3069.5846 3072.2337 3078.2757 3084.6034 3090.3690 3126.7763 3135.8596 3176.0880
redmass: 3.0017 1.9490 1.3007 1.6066 1.5741 2.2724 2.8760 2.8464 3.1587 4.3772 1.9707 3.6108 3.4564 4.3878 2.1014 4.2069 2.4740 2.7251 2.3744 2.7353 2.3830 2.5251 1.9877 2.1016 2.0335 2.2125 1.5703 1.5167 1.3036 2.0770 1.8167 2.2218 1.4683 1.4090 1.3848 1.8174 2.1214 1.6640 1.7057 2.4993 1.8184 1.3191 1.5061 1.4346 1.7355 1.8209 1.6969 1.1538 1.1543 1.0531 1.0557 1.0832 1.0557 1.0490 5.5037 1.0445 1.0427 1.0881 1.0862 1.0676 1.0796 1.0862 1.0880 1.1000 1.0936 1.0991 1.1056 1.0859 1.1171
irintensity: 1.4566 1.3196 0.4041 1.4832 0.2674 0.2209 4.3324 2.2071 3.8088 5.3714 0.8122 9.7308 2.6979 3.0806 63.7904 1.3805 48.1841 11.4417 5.4829 3.3834 8.3245 5.0207 3.6162 2.9302 3.5011 3.9119 5.7893 3.6788 22.9211 3.5325 7.1046 7.5370 0.9043 2.4687 1.2546 2.1696 4.8305 2.2623 0.6224 4.2735 7.5851 1.7735 7.6628 6.1532 21.0515 0.1235 3.9561 2.7902 1.1104 3.0552 16.4481 23.2351 14.6424 7.7833 5.2923 106.7051 66.0323 45.8937 39.6329 4.5475 26.7981 40.8534 48.6404 38.0104 7.0382 29.0724 16.8632 13.4572 36.2948
temp: 298.150 k
press: 1.00000 atm
elementType: 7 7 6 6 6 6 6 6 6 6 6 1 1 1 1 1 1 1 1 1 1 1 1 1 1
symmnumber: 1
zpe: 563000.6 jmol-1
zpe.correction: 0.214436 hartree
zpe.thermalcorrener: 0.224008 hartree
zpe.thermalcorrenthalpy: 0.224952 hartree
zpe.thermalcorrgfe: 0.180690 hartree
zpe.sumelectzpe: -459.888053 hartree
zpe.sumelectthermal: -459.878481 hartree
zpe.sumelectthermalent: -459.877536 hartree
zpe.sumelectthermalfe: -459.921798 hartree
dipole: 0.4779 -0.2440 0.4742
dipole: 0.7160
quadrupole: -66.3119 -61.7050 -68.7426
quadrupole: 0.2296 1.8283 0.3519
quadrupole: -0.7254 3.8815 -3.1561 0.2296 1.8283 0.3519
hfenergy: -460.1024887 hartree
pointgroup: C01 [X(C9H14N2)]
dipole: -0.1842865 0.0777899 0.1983695 debye
dipolederiv: -0.5629608 0.0248636 -0.0564121 -0.0298751 -0.1976503 -0.1076567 -0.0838804 0.0151943 -0.3105981 -0.4017274 0.04979 -0.0194468 0.0482477 -0.2144636 -0.1071924 0.1024453 -0.0015873 -0.3815599 -0.186742 0.0354523 0.0136273 -0.0183307 -0.0352293 0.1206262 -0.0225026 0.1645679 0.0043466 -0.0581372 -0.0113135 0.0022941 0.0037391 -0.1020932 0.0862399 -0.0298661 0.0495523 0.0980931 0.4601409 -0.0284173 0.0252459 0.020832 0.0467454 -0.0562841 0.0612604 -0.1175726 0.3059092 0.332451 -0.0412212 -0.0225102 -0.022069 0.1956726 -0.0361576 0.0827914 0.0146898 0.1928574 -0.026389 0.019368 0.0055447 0.0226505 -0.0872467 0.0235002 0.0379906 -0.0125093 -0.1150986 0.1132431 0.0572891 -0.1359157 -0.1799946 -0.0206247 -0.1391721 -0.1547301 -0.1418926 -0.1379476 0.0083191 -0.1580448 -0.0301311 0.0433464 0.0305587 -0.0832102 -0.212153 -0.0686083 -0.2361713 0.197093 -0.0705644 0.0466264 -0.1091692 0.2677551 0.1024095 0.0943289 0.0859412 0.2786393 0.2421442 0.1177039 0.0421677 0.1393097 0.1851771 0.021558 -0.002213 0.0261831 0.2730839 0.0741273 0.0590817 0.0134282 0.0154339 -0.0789321 -0.0948803 -0.0059761 -0.1252703 -0.0067179 0.036897 -0.0326994 0.0587514 -0.0089984 0.0852512 -0.0041392 0.026735 0.0216529 -0.1265566 0.0159325 -0.003322 -0.0093689 -0.013776 -0.045034 0.1191678 -0.0199501 0.1230799 -0.0396695 0.033809 -0.0304106 0.0059829 -0.0303238 -0.1585618 0.0264556 -0.0040807 0.026047 0.0673518 -0.0623468 0.058887 0.1241375 0.0295312 0.0537502 -0.0139961 0.0959808 -0.010123 0.0562605 -0.0248389 -0.0619024 -0.1509199 -0.0409721 0.0657878 -0.0393705 -0.104725 -0.0403732 -0.0086942 -0.0628396 -0.0592563 0.1032358 -0.0450663 0.0792143 0.0737588 0.1683383 0.0793966 0.1219228 -0.0379025 0.1183816 0.0102479 0.1619558 0.0043341 0.0470127 0.061719 0.0334174 0.1779961 0.1115207 -0.0436765 0.0126038 0.0164363 -0.1325033 0.0630326 0.0035769 0.1135563 0.0141244 -0.1618749 0.0365236 0.0861785 -0.0354039 0.0951699 0.0049948 0.0691568 -0.0382981 0.0478286 -0.018206 -0.0460865 -0.1668966 0.0395579 0.0142803 -0.0249039 -0.0810757 -0.1235191 -0.1572214 0.0779795 0.0034274 -0.0172751 -0.0801604 -0.1254299 0.1024546 0.0034589 0.1128517 0.024808 -0.1065136 0.0511922 0.0453301 0.139335 0.0432932 -0.0413561 0.0428933 -0.0454254 0.0707676 0.0068211 -0.0450456 0.0134743 -0.0662359 0.030779 -0.0428913 -0.1295228 -0.1409515 -0.2137544 unknown
polarizability: 118.2793609|-0.2532416|103.5038584|-3.404494|-3.3684131|83.7174646 unknown
InChI: InChI=1S/C9H14N2/c1-10-8-5-9(11(10)2)7-4-3-6(7)8/h3-4,6-9H,5H2,1-2H3
charge 0 multiplicity 1
25 atoms
N  1.368977 -0.77312 0.258715
N  1.386013 0.560394 -0.490841
C  -1.10416 -0.92598 -0.177826
C  -1.019825 0.518492 -0.870568
C  0.008975 -0.821504 0.920148
C  0.097043 1.216161 -0.039733
C  -0.101578 0.646394 1.399251
C  -2.550281 -0.543815 0.173302
C  -2.481731 0.687882 -0.425684
C  1.696606 -1.87607 -0.670745
C  2.600424 1.313655 -0.079284
H  -0.982204 -1.803532 -0.833465
H  -0.798903 0.550213 -1.948875
H  -0.00237 -1.598736 1.700053
H  0.156138 2.310432 -0.146394
H  -1.074874 0.894566 1.846287
H  0.712161 0.919793 2.089291
H  -3.334922 -1.069723 0.725638
H  -3.191285 1.513709 -0.532295
H  1.613693 -2.831779 -0.120865
H  2.74397 -1.762916 -1.000368
H  1.05825 -1.916175 -1.579098
H  2.629374 2.262261 -0.646029
H  3.490376 0.721539 -0.351068
H  2.652333 1.530457 1.010452
