program: Gaussian 09
title: 000144217
version: EM64L-G09RevD.01
frameworkgroup: C1[X(C7H15NO)]
method: RPBEPBE
basis: SDD
operation: Freq
keyword: #p
keyword: freq=noraman
keyword: PBEPBE/SDD
title: #p freq=noraman PBEPBE/SDD
converged: YES YES NO NO
title: Mulliken charges:
elementType: O N C C C C C C C H H H H H H H H H H H H H H H
charge: -0.252870 -0.059325 0.312301 -0.367299 -0.472498 -0.286368 -0.722376 -0.708137 -0.731739 0.228503 0.208544 0.221823 0.229867 0.209701 0.207751 0.250209 0.210678 0.199600 0.222875 0.244332 0.189965 0.217656 0.214109 0.232698
chargesum: 0.00000
title: Mulliken charges with hydrogens summed into heavy atoms:
elementType: O N C C C C C C C
charge: -0.252870 -0.059325 0.312301 0.069748 -0.020808 0.131084 -0.061888 -0.050965 -0.067276
polarizability: 1.00878553e+02 1.48736591e+00 8.32240241e+01 5.79700814e-02 -1.00829753e-02 7.45766285e+01
1716.lowfreq: -21.2907 -9.3913 -0.0005 -0.0004 0.0003 8.2040 68.3158 109.9607 133.6795
frequency: 68.2844 109.9048 133.6755 178.7492 200.1314 225.0566 245.0980 297.0396 324.2417 336.0513 373.4248 451.7592 515.5362 533.2526 660.0569 721.1510 779.1564 801.1661 866.5642 908.3396 912.5069 924.6757 932.8114 946.5183 974.7358 1000.2566 1017.8029 1033.6570 1057.5442 1123.4452 1179.5663 1188.2384 1217.4057 1226.5571 1236.5861 1252.2643 1287.3367 1311.0046 1337.0160 1364.9972 1370.2251 1393.7373 1448.0442 1456.2719 1464.8848 1466.3036 1471.1742 1476.3603 1476.7465 1481.6460 1499.9287 2951.4561 2980.2397 2984.2174 2988.2425 2990.3032 3027.2650 3066.0922 3070.6289 3075.2358 3079.5669 3084.7188 3090.9914 3098.6010 3098.6550 3104.8117
redmass: 2.2385 1.7381 2.3092 1.3113 2.6249 1.0663 1.1088 2.4227 2.6559 2.5702 2.4286 2.9841 2.7984 2.9002 4.8215 3.0577 3.4348 1.5786 2.4551 1.7585 2.6001 1.6340 2.0998 1.2177 3.1680 2.3719 1.5098 1.7915 2.5527 1.9285 1.2215 1.3173 1.2429 2.3331 2.8073 2.9413 1.2852 1.2628 1.2872 1.2055 1.2187 1.2086 1.0513 1.0830 1.0818 1.0542 1.0506 1.0588 1.0536 1.0931 1.0562 1.0656 1.0350 1.0356 1.0606 1.0375 1.0613 1.0980 1.0999 1.0988 1.0983 1.1002 1.0994 1.1002 1.1059 1.0993
irintensity: 0.5388 0.6154 5.5701 2.1003 2.2115 0.2442 0.4603 2.0989 2.6044 0.9039 1.9652 2.1359 2.3987 2.4455 2.2119 9.3589 5.1759 3.6895 5.1774 1.9382 5.7440 2.7320 18.5483 0.3985 14.6643 17.3220 0.0680 2.6549 2.1205 4.3838 9.1908 5.3489 4.9474 52.6166 19.0789 14.0487 8.2742 11.1384 1.1118 35.9159 27.0110 18.7793 0.9513 2.8932 3.6229 2.4888 2.0723 5.0520 10.9664 4.6062 19.2063 43.7153 21.7624 44.0606 84.8940 17.2074 49.8833 19.4145 10.0427 6.0923 56.9651 4.3144 54.8210 13.5485 61.4466 32.9319
temp: 298.150 k
press: 1.00000 atm
elementType: 8 7 6 6 6 6 6 6 6 1 1 1 1 1 1 1 1 1 1 1 1 1 1 1
symmnumber: 1
zpe: 555963.9 jmol-1
zpe.correction: 0.211755 hartree
zpe.thermalcorrener: 0.222250 hartree
zpe.thermalcorrenthalpy: 0.223194 hartree
zpe.thermalcorrgfe: 0.176719 hartree
zpe.sumelectzpe: -404.902343 hartree
zpe.sumelectthermal: -404.891849 hartree
zpe.sumelectthermalent: -404.890905 hartree
zpe.sumelectthermalfe: -404.937379 hartree
dipole: -0.7359 1.6714 0.4315
dipole: 1.8765
quadrupole: -50.3252 -57.4039 -58.1538
quadrupole: -0.2957 -0.0501 0.1786
quadrupole: 4.9691 -2.1096 -2.8595 -0.2957 -0.0501 0.1786
hfenergy: -405.1140988 hartree
pointgroup: C01 [X(C7H15N1O1)]
dipole: 0.2994457 -0.649868 0.1818217 debye
dipolederiv: -0.7254146 -0.1367951 0.0779981 -0.0393977 -0.5142358 0.0140212 -0.0904002 -0.0805805 -0.2550342 -0.2266426 0.1809873 0.0496234 0.1790884 0.032373 0.0248254 0.1470955 0.0609523 -0.3377231 0.5620592 -0.0588004 -0.0559339 -0.075273 0.1782516 0.0140419 -0.0580572 -0.0024008 0.3515792 0.0398682 -0.018038 0.0189112 -0.070003 0.1487351 -0.0040031 -0.06581 0.001184 0.2991029 -0.026777 -0.0760213 0.0363796 -0.042122 -0.0914575 0.0269115 0.0668764 0.0712667 0.140555 0.5832924 0.1445903 -0.0885472 -0.0332089 0.2476027 -0.0193056 -0.134256 -0.1028585 0.3688358 -0.1141047 -0.0086956 0.0224188 -0.0006029 0.0110027 -0.0255573 0.0740074 -0.0455661 -0.2102325 -0.0093418 0.0332649 -0.030358 0.0426196 -0.0837544 0.0384844 -0.001856 0.0472366 -0.0068615 -0.0730143 -0.0631897 -0.0215784 -0.02784 -0.0400628 -0.0478514 0.035337 -0.0412039 0.0152258 0.0887858 -0.0629671 -0.0126561 -0.0499079 -0.1028866 -0.059994 -0.0278786 -0.0659928 0.0334843 0.0104735 0.0141222 0.0297215 0.0176768 0.0151242 0.0307713 -0.006057 0.1182506 -0.1980909 -0.0475577 0.0638024 -0.0821776 0.0638006 0.0425743 0.0446691 -0.1448845 0.0676855 -0.0316976 0.0322795 0.0288056 0.0513429 0.0518729 0.0347851 -0.0571378 0.119327 -0.0857977 -0.0866753 -0.0695385 -0.0895281 -0.0533083 -0.0797606 0.0096099 -0.054486 -0.0821567 -0.0914628 -0.0034389 -0.0278995 -0.0263657 0.0449446 -0.000568 0.0144698 0.052185 0.1586236 0.1229306 -0.1676717 0.0787516 -0.0918187 -0.0814631 -0.0760858 -0.0261659 -0.0788256 -0.0583162 -0.0397429 0.0552371 -0.1687647 0.0447504 0.0852514 0.0492253 0.0928886 -0.0138266 0.0643501 -0.0074524 0.0773056 0.080534 0.0744584 -0.059266 0.0638387 -0.1047729 0.1236743 -0.044002 0.0780113 0.0038368 0.1075592 0.0051563 0.0308531 0.0001963 0.0809289 -0.0319627 -0.0031193 0.0163717 -0.1624028 0.090556 -0.0993193 -0.0305543 -0.0627781 -0.069721 -0.0392726 -0.0324472 -0.0701418 0.071757 -0.1958278 0.0470928 0.0403968 0.0056827 0.0778121 0.0178489 0.0725544 0.0059475 0.0735131 0.0706589 0.0935237 -0.0501574 0.0563293 -0.1113852 0.0723659 -0.0508547 0.1029185 0.0255321 -0.178114 -0.0108446 0.0302867 0.0260025 0.083859 -0.0137854 0.0551862 -0.0047064 0.0910425 0.1181789 0.0118293 0.0478724 0.0012148 0.074425 -0.0137906 0.006738 -0.0548487 -0.1471788 unknown
polarizability: 100.8023059|1.4872173|83.2144741|-1.3846558|-0.4099239|74.662426 unknown
InChI: InChI=1S/C7H15NO/c1-7(2,3)8-5-4-6-9-8/h4-6H2,1-3H3
charge 0 multiplicity 1
24 atoms
O  0.88035 1.124858 0.220873
N  0.143454 -0.1069 -0.346963
C  -1.285581 -0.008191 0.139226
C  0.992384 -1.205037 0.223532
C  2.433926 -0.715846 -0.077115
C  2.271173 0.834319 -0.171477
C  -1.422037 0.103739 1.683189
C  -1.896795 1.241186 -0.540134
C  -1.995124 -1.283725 -0.382003
H  0.751886 -2.146711 -0.297617
H  0.845883 -1.33708 1.316494
H  3.127732 -1.023403 0.723365
H  2.801202 -1.124568 -1.033357
H  2.907776 1.39217 0.536061
H  2.452002 1.187279 -1.205017
H  -0.80877 0.939412 2.060361
H  -2.477664 0.292109 1.94998
H  -1.109082 -0.824024 2.196708
H  -1.774117 1.173929 -1.635425
H  -1.388561 2.15624 -0.194081
H  -2.973962 1.317713 -0.304102
H  -1.627458 -2.195247 0.123591
H  -3.080105 -1.206155 -0.189183
H  -1.84041 -1.394768 -1.470007
