program: Gaussian 09
title: 000144187
version: EM64L-G09RevD.01
frameworkgroup: C1[X(C13H17NS)]
method: RPBEPBE
basis: SDD
operation: Freq
keyword: #p
keyword: freq=noraman
keyword: PBEPBE/SDD
title: #p freq=noraman PBEPBE/SDD
converged: NO YES NO NO
title: Mulliken charges:
elementType: S N C C C C C C C C C C C C C H H H H H H H H H H H H H H H H H
charge: 0.121355 0.345270 -0.212119 0.447097 -0.365267 0.042338 -0.713613 0.410975 -0.410837 -0.694052 -0.536969 -0.422666 -0.265852 -0.674648 -0.829546 0.221138 0.202844 0.196693 0.228887 0.218173 0.208725 0.239951 0.216155 0.213621 0.226296 0.224669 0.216474 0.242225 0.227893 0.220548 0.222709 0.231533
chargesum: 0.00000
title: Mulliken charges with hydrogens summed into heavy atoms:
elementType: S N C C C C C C C C C C C C C
charge: 0.121355 0.345270 0.009019 0.447097 0.034270 0.042338 -0.057828 0.410975 -0.170886 -0.037980 -0.095827 -0.180441 -0.037959 0.000142 -0.829546
polarizability: 2.06526658e+02 -3.71282061e+01 2.06336737e+02 2.45875809e+00 1.96946600e+00 1.03607973e+02
1716.lowfreq: -11.4797 -4.9209 -0.0018 -0.0010 0.0006 4.9305 13.8477 18.7561 39.1239
frequency: 9.2872 18.7021 39.0708 62.4222 79.8601 113.4723 136.0810 167.3438 185.8717 203.8527 213.9854 234.6514 240.3130 280.9548 310.8867 339.0305 374.4811 385.4993 405.3843 423.6978 445.7015 509.2941 539.6673 545.2497 601.1328 628.1355 717.2701 759.5058 782.0558 791.9028 808.7047 818.2298 888.3936 903.8604 911.7080 960.1314 977.2929 982.6019 1006.3989 1029.6535 1049.1266 1062.0685 1068.4506 1100.1434 1113.0836 1157.3050 1183.4901 1212.5280 1237.7950 1247.6840 1268.0632 1271.2646 1292.8252 1314.5675 1331.8977 1333.2628 1379.9061 1387.2379 1387.9533 1392.4373 1439.4471 1459.8844 1464.8919 1473.2016 1475.4696 1476.2405 1477.4019 1478.0920 1483.9763 1489.6878 1582.0699 1597.8083 2185.0754 2973.4438 2976.4658 2978.6987 2985.0794 2995.0923 3007.2469 3028.9078 3046.3242 3070.9505 3074.3682 3076.7507 3081.2626 3083.7155 3089.8137 3123.4622 3132.8571 3157.5642
redmass: 3.3325 7.3261 4.0642 2.6211 2.8633 3.8012 2.1661 2.4888 2.2944 1.0924 1.1902 1.7924 2.4128 3.0851 3.1753 3.8936 3.7361 5.7584 7.7324 5.8093 3.6828 3.6437 4.5668 3.8727 3.0140 3.9023 4.7456 2.1584 1.2463 1.2565 2.0573 2.1056 2.3056 6.9373 1.3916 1.2546 1.3426 2.2313 1.5741 2.6929 2.0069 1.9236 1.5972 2.5683 1.5485 2.2323 1.1807 3.3049 1.3955 1.4170 1.5724 2.0702 1.2856 1.5373 1.5728 1.8406 2.6851 1.1998 1.2064 1.2345 2.6898 2.2986 1.0665 1.0464 1.0506 1.0654 1.0747 1.0749 1.0665 1.1037 7.1720 5.9169 12.8729 1.0545 1.0373 1.0390 1.0348 1.0601 1.0857 1.0986 1.1015 1.1002 1.0990 1.0999 1.1000 1.1003 1.1012 1.0857 1.0916 1.0991
irintensity: 0.0174 0.1156 0.3621 0.1065 0.1081 0.8705 0.0129 0.7034 0.0867 0.1200 0.2615 0.4414 0.1847 0.0107 1.5101 0.9500 0.4097 0.7775 0.1248 2.3361 2.6699 1.2838 0.1541 0.0680 9.2547 4.0426 18.9933 30.5033 9.4091 18.9023 23.7264 2.3236 10.5223 29.6727 0.2162 7.1493 0.3666 2.3398 9.7532 4.5828 0.5005 13.6034 1.4665 1.7673 4.5559 0.7662 1.6894 0.2294 0.1490 2.3114 2.5722 0.1347 2.6371 2.0244 1.3420 3.2017 3.1203 4.3733 13.7021 14.7600 21.7246 5.6270 2.9699 8.2537 5.8519 4.7037 21.4220 6.4096 15.2825 12.6885 6.4930 1.7816 1082.2595 26.5181 34.0527 37.5052 31.9225 28.1759 4.5906 16.4478 7.0533 9.2899 54.8500 67.5271 40.4479 39.1844 39.2053 0.2832 21.7592 29.4271
temp: 298.150 k
press: 1.00000 atm
elementType: 16 7 6 6 6 6 6 6 6 6 6 6 6 6 6 1 1 1 1 1 1 1 1 1 1 1 1 1 1 1 1 1
symmnumber: 1
zpe: 697351.6 jmol-1
zpe.correction: 0.265607 hartree
zpe.thermalcorrener: 0.282278 hartree
zpe.thermalcorrenthalpy: 0.283222 hartree
zpe.thermalcorrgfe: 0.218347 hartree
zpe.sumelectzpe: -957.288788 hartree
zpe.sumelectthermal: -957.272117 hartree
zpe.sumelectthermalent: -957.271173 hartree
zpe.sumelectthermalfe: -957.336048 hartree
dipole: -2.4354 2.4642 0.2484
dipole: 3.4735
quadrupole: -97.6244 -95.4010 -101.1099
quadrupole: 7.5666 0.6533 -0.5317
quadrupole: 0.4207 2.6441 -3.0648 7.5666 0.6533 -0.5317
hfenergy: -957.5543951 hartree
pointgroup: C01 [X(C13H17N1S1)]
dipole: 0.214076 1.2677763 0.4630475 debye
polarizability: 170.5880555|7.8591498|219.0915135|11.269192|50.9142392|126.7917991 unknown
InChI: InChI=1S/C13H17NS/c1-4-10(3)12-8-6-7-11(5-2)13(12)14-9-15/h6-8,10H,4-5H2,1-3H3
charge 0 multiplicity 1
32 atoms
S  -0.974464 -3.87299 -1.522954
N  -0.623545 -1.287326 -0.402204
C  2.10954 -0.399867 0.181182
C  0.86315 0.448925 0.442537
C  3.035547 0.250159 -0.891407
C  -0.454278 -0.023486 0.145436
C  2.891382 -0.667682 1.495192
C  -1.621127 0.769089 0.398131
C  0.983197 1.746347 0.995924
C  2.377972 0.384041 -2.281189
C  -3.009458 0.261398 0.042999
C  -1.440749 2.053288 0.956717
C  -0.149778 2.54517 1.253122
C  -3.346726 0.446252 -1.462401
C  -0.772367 -2.386624 -0.875294
H  1.788442 -1.379679 -0.220602
H  3.950518 -0.370102 -0.972019
H  3.36408 1.247225 -0.53441
H  2.249122 -1.149673 2.253811
H  3.752592 -1.332749 1.299243
H  3.28279 0.270626 1.930104
H  1.981379 2.132771 1.231248
H  3.078201 0.829837 -3.010948
H  2.06886 -0.604369 -2.670415
H  1.479521 1.02647 -2.239186
H  -3.10466 -0.810001 0.302003
H  -3.757746 0.805242 0.648715
H  -2.323984 2.669894 1.160549
H  -0.029733 3.544132 1.686099
H  -3.295236 1.512058 -1.748851
H  -4.365946 0.078486 -1.678846
H  -2.641395 -0.112964 -2.102187
