program: Gaussian 09
title: 000144166
version: EM64L-G09RevD.01
frameworkgroup: C1[X(C7H14O3)]
method: RPBEPBE
basis: SDD
operation: Freq
keyword: #pfreq=noraman
keyword: PBEPBE/SDD
title: #p freq=noraman PBEPBE/SDD
converged: YES YES NO NO
title: Mulliken charges:
elementType: O O O C C C C C C C H H H H H H H H H H H H H H
charge: -0.271699 -0.288128 -0.288142 0.347410 -0.713669 -0.512601 -0.517313 -0.078762 -0.199679 -0.727941 0.229708 0.233435 0.255793 0.247419 0.220904 0.232334 0.232649 0.234730 0.216887 0.257609 0.228421 0.222815 0.220598 0.217221
chargesum: 0.00000
title: Mulliken charges with hydrogens summed into heavy atoms:
elementType: O O O C C C C C C C
charge: -0.271699 -0.288128 -0.288142 0.347410 0.005267 0.188056 0.166953 0.178847 0.028742 -0.067306
polarizability: 1.20367237e+02 3.90480273e+00 8.18879477e+01 1.40499418e+00 1.83140651e+00 7.08966012e+01
1716.lowfreq: -21.5710 -13.7712 -0.0011 -0.0010 -0.0009 5.9315 46.0220 67.4142 88.4655
frequency: 45.7051 67.3993 88.4563 95.0710 107.6061 146.5467 170.3928 189.0303 213.8951 230.1110 252.2654 265.7020 316.9389 348.5562 377.0856 402.0373 500.2192 584.4299 598.1800 696.8327 790.4128 826.6812 849.9655 926.2893 939.8878 987.0139 996.6641 1039.6334 1085.0496 1104.6388 1111.6982 1117.3946 1121.5173 1127.5213 1156.0265 1158.7090 1205.2554 1267.2768 1288.8551 1384.0989 1399.1577 1417.6700 1427.1006 1450.6627 1452.0993 1460.7618 1462.7240 1470.4073 1476.5361 1479.8292 1485.4529 1685.3130 2962.0985 2963.8242 2992.3363 3012.1121 3034.2878 3055.2979 3070.9372 3095.8722 3110.3659 3115.6287 3124.0764 3125.1490 3126.5004 3139.0312
redmass: 3.3719 1.6209 2.7555 1.3337 2.0411 1.3524 1.5729 1.2651 1.8210 1.7005 2.6863 2.4697 3.6927 4.2875 3.3223 3.9837 4.8415 4.4171 4.2356 5.1035 1.6793 2.8719 2.7543 1.5819 1.0835 7.9782 8.6855 1.4558 2.8703 1.9604 1.4172 1.4004 1.7429 2.3921 1.4798 1.9025 4.2281 1.3562 1.1856 1.2548 1.2331 1.1324 1.1349 1.0539 1.0506 1.0531 1.0475 1.0546 1.0584 1.0490 1.0503 5.9028 1.0361 1.0321 1.0295 1.0356 1.0978 1.1027 1.0980 1.1033 1.1011 1.1007 1.0999 1.0931 1.1047 1.0920
irintensity: 1.9437 1.5914 3.6762 2.9018 2.5629 2.3540 5.5840 1.9225 0.6436 7.3974 4.3461 0.6827 4.4607 3.3284 6.9938 7.4210 2.9942 5.2111 3.1656 17.0089 23.5730 68.0253 109.4270 4.7757 76.7758 118.3787 103.5704 4.6087 304.8267 61.0722 33.9189 7.1008 130.2207 114.5081 22.9341 122.9395 89.9715 5.1932 5.5009 43.1858 7.2797 11.8691 9.7151 3.3423 4.8328 6.8965 13.1882 9.6113 13.0940 11.4919 9.7927 63.6041 67.3693 53.5139 44.3661 7.3899 33.2021 44.8334 27.5161 29.8995 20.7967 21.5328 9.3270 17.9554 29.6415 22.8789
temp: 298.150 k
press: 1.00000 atm
elementType: 8 8 8 6 6 6 6 6 6 6 1 1 1 1 1 1 1 1 1 1 1 1 1 1
symmnumber: 1
zpe: 525018.8 jmol-1
zpe.correction: 0.199969 hartree
zpe.thermalcorrener: 0.213294 hartree
zpe.thermalcorrenthalpy: 0.214239 hartree
zpe.thermalcorrgfe: 0.160216 hartree
zpe.sumelectzpe: -499.929815 hartree
zpe.sumelectthermal: -499.916489 hartree
zpe.sumelectthermalent: -499.915545 hartree
zpe.sumelectthermalfe: -499.969568 hartree
dipole: -0.8558 -1.5747 -0.4208
dipole: 1.8409
quadrupole: -55.3298 -57.0167 -61.9358
quadrupole: 1.7339 2.8714 -1.7639
quadrupole: 2.7643 1.0774 -3.8417 1.7339 2.8714 -1.7639
hfenergy: -500.1297837 hartree
pointgroup: C01 [X(C7H14O3)]
dipole: -0.3329394 -0.6347642 -0.1039092 debye
dipolederiv: -0.7838856 0.3336949 -0.1081451 0.2494216 -0.9763783 0.1654478 -0.1687408 0.1684744 -0.5916609 -0.8257607 -0.2300104 -0.1384817 -0.3068127 -0.9357225 -0.1139144 -0.248821 -0.3660592 -0.6206911 -2.0600452 -0.057826 0.1628874 0.3117796 -0.4242975 -0.0591294 0.3063513 -0.0493436 -0.4364365 1.932692 -0.2503056 0.099636 0.4037225 1.42408 -0.0576168 0.1869884 0.3455144 1.0527169 -0.1143449 0.0299907 -0.0261285 -0.078772 -0.1262393 0.1049787 -0.0401917 0.0772824 -0.273629 0.3055425 -0.0180513 0.0345098 -0.0767473 0.4557866 -0.1068701 0.1734107 -0.2389128 0.3545313 0.4840719 0.2713292 0.1045307 0.1609919 0.480099 0.0025647 0.0031956 -0.065692 0.2289476 1.3148472 0.0461133 -0.1305299 -0.64877 0.1210622 0.2064359 -0.2174622 0.1348316 -0.0167398 -0.2366246 -0.0123584 -0.0121349 -0.1386246 0.0265305 0.1438797 -0.0531519 0.1281711 -0.2393155 -0.0196523 0.044696 0.0343046 -0.0551814 0.0410664 -0.0206826 0.0131003 -0.0357911 0.0982149 0.0104298 0.1159048 -0.0083866 0.1185184 -0.0144479 0.0169896 0.0108673 -0.0052232 0.0795604 -0.0848336 -0.0889477 0.0548942 -0.1057825 0.0617012 0.0450466 0.0615866 0.0263767 0.0949389 0.1007494 -0.0329515 -0.0442316 -0.0235584 0.0223759 -0.1052119 -0.0554344 -0.0836185 0.0044138 -0.0006889 -0.1544102 0.0156729 -0.0846868 -0.0430738 0.0452053 -0.0426071 0.0461059 0.0527406 -0.1096561 0.1373045 0.0060549 0.1007551 0.0224148 0.0261319 0.0348302 0.0124614 0.0830563 0.1054909 -0.0158529 0.0044615 -0.0142032 0.0110025 -0.1082257 -0.0426715 -0.0153999 -0.1156651 0.0684647 -0.0391553 -0.0147614 -0.0613446 0.0345484 -0.0784279 -0.0551832 -0.1143284 -0.0934289 -0.1264182 0.021416 0.0095359 0.1065146 0.0111289 -0.0193651 0.0757924 0.0115991 0.0892783 0.0051645 -0.0234754 -0.0432786 -0.0454919 -0.101321 0.109305 0.0227478 0.1858333 -0.0322879 0.0801484 0.0005417 0.0031835 0.0866348 -0.0267127 -0.0898118 -0.0179447 -0.0855147 0.1558033 0.0559295 0.0172115 0.0200437 0.0232353 -0.073815 -0.1070398 0.0174506 -0.1000311 0.1441663 -0.0563563 -0.0396924 0.108477 -0.0199568 0.035407 0.0981785 0.1771722 0.0835348 -0.0455092 -0.1123207 0.0302434 -0.1042631 0.0842997 0.1018523 -0.0089976 -0.1478859 0.0173062 -0.0491315 0.0670564 -0.085409 -0.0278508 0.0140588 -0.1270476 -0.0888704 0.0066011 -0.0775768 0.0761269 unknown
polarizability: 120.2103532|4.6364756|82.2235691|-1.5508899|0.8130192|70.7178638 unknown
InChI: InChI=1S/C7H14O3/c1-5-6-10-7(2,8-3)9-4/h5-6H,1-4H3
charge 0 multiplicity 1
24 atoms
O  -1.899496 0.914876 0.561513
O  -1.032251 -0.985853 -0.623971
O  0.383992 0.66366 0.195087
C  -0.849886 -0.054598 0.50263
C  -0.785742 -0.742469 1.867113
C  -1.996434 1.797903 -0.622575
C  -2.239859 -1.821173 -0.542359
C  1.524206 -0.099844 -0.15375
C  2.763636 0.438692 -0.060304
C  4.018561 -0.288631 -0.489797
H  -0.009658 -1.525749 1.856483
H  -1.757685 -1.18961 2.130675
H  -0.528493 0.00863 2.630161
H  -1.157218 2.512593 -0.632133
H  -2.955839 2.324273 -0.504944
H  -1.988372 1.204134 -1.554182
H  -2.348968 -2.274034 -1.540147
H  -3.129817 -1.207635 -0.307705
H  -2.130079 -2.622467 0.213979
H  1.31413 -1.100742 -0.548267
H  2.86447 1.45915 0.332431
H  4.536897 0.24823 -1.308501
H  4.740295 -0.373141 0.346034
H  3.792013 -1.309195 -0.84787
