program: Gaussian 09
title: 000144158
version: EM64L-G09RevD.01
frameworkgroup: C1[X(C13H18N2)]
method: RPBEPBE
basis: SDD
operation: Freq
keyword: #pfreq=noraman
keyword: PBEPBE/SDD
title: #p freq=noraman PBEPBE/SDD
converged: YES YES NO NO
title: Mulliken charges:
elementType: N N C C C C C C C C C C C C C H H H H H H H H H H H H H H H H H H
charge: -0.252159 -0.259182 0.455307 -0.546897 -0.482674 -0.424897 -0.441030 0.257935 0.267388 -0.662029 -0.684861 -0.383551 -0.386788 -0.247874 -0.243890 0.234805 0.241762 0.224933 0.237158 0.205735 0.222313 0.215421 0.223458 0.223561 0.215366 0.234449 0.237066 0.218199 0.231293 0.220316 0.222479 0.213485 0.213406
chargesum: 0.00000
title: Mulliken charges with hydrogens summed into heavy atoms:
elementType: N N C C C C C C C C C C C C C
charge: -0.252159 -0.259182 0.455307 -0.070331 -0.020584 0.003151 -0.002151 0.257935 0.267388 0.011347 0.001697 -0.163235 -0.164309 -0.034389 -0.030484
polarizability: 2.10210425e+02 -6.64045367e-01 1.51853813e+02 4.54608210e+00 7.92641746e-01 9.67228979e+01
1716.lowfreq: -16.3383 -2.4720 -0.0010 -0.0008 -0.0004 9.8310 49.9756 58.4599 114.4615
frequency: 49.4439 58.1261 114.4456 122.8636 140.5301 144.5925 166.4644 241.1169 245.9392 263.8667 280.7594 294.0263 347.9915 351.1960 423.5165 464.8311 519.2780 526.0907 551.0389 566.4115 597.9163 612.6578 678.8627 725.2643 731.1463 755.7344 798.6922 816.2492 820.4614 840.8030 873.9971 878.1861 904.5883 937.6970 951.9528 964.0148 1009.8119 1016.6593 1043.0356 1054.5975 1057.2831 1093.2716 1112.7201 1114.3288 1114.5036 1132.3845 1158.6317 1162.1616 1175.3513 1206.0103 1215.2222 1229.3027 1252.0755 1278.1064 1295.6900 1299.7747 1306.9794 1311.3567 1345.5384 1350.0753 1429.8701 1435.8172 1437.6014 1449.6631 1451.9967 1461.0809 1467.5256 1468.6093 1474.1777 1482.9577 1487.9944 1493.3357 1528.5221 1614.8922 1616.2206 2910.4263 2913.8706 2986.3503 2993.0835 2998.6549 3013.3510 3016.7125 3027.4142 3054.9782 3059.2137 3070.9106 3075.9048 3077.8379 3081.2506 3123.5133 3135.1848 3146.9581 3162.9767
redmass: 3.3294 2.8787 2.7458 2.4870 1.1859 1.1203 2.5838 2.3678 2.1823 2.6696 3.7406 2.3471 4.1481 3.6206 3.1285 4.0445 3.7198 2.1413 5.2792 4.0575 2.9510 4.3144 2.5937 1.2184 4.3352 2.8758 2.9887 2.1137 1.4382 2.1264 2.2581 1.3990 2.4768 1.2766 1.7063 1.7851 1.5486 2.1135 2.3467 2.3508 2.3487 2.8387 1.3499 1.4304 1.3537 2.0223 1.6956 1.3006 1.7067 1.6817 1.4840 1.4782 3.0318 1.3113 1.3620 1.5489 1.4579 1.5432 4.6721 4.2668 3.3411 1.3984 1.2366 1.4828 1.1707 1.0747 1.0958 1.0859 1.0733 1.0995 1.0837 1.0770 4.9791 7.1950 7.4030 1.0521 1.0505 1.0645 1.0617 1.0638 1.0636 1.0829 1.0793 1.0967 1.1005 1.1030 1.0989 1.0998 1.1028 1.0841 1.0892 1.0941 1.1001
irintensity: 0.1460 0.1961 10.4828 1.0188 0.6952 0.5386 0.3847 0.0667 0.3990 0.4559 1.0466 0.1159 0.1482 1.4065 4.5976 11.4436 1.7744 1.0976 10.5608 0.0473 0.4149 2.3261 1.9077 120.0039 0.2059 0.1891 3.4119 5.8547 0.2765 7.1636 0.6323 6.8722 2.3718 0.0116 5.3966 20.4303 9.9700 32.4103 9.1448 9.6319 11.8935 30.2664 8.2234 33.8258 15.4191 33.7946 3.8126 1.0840 0.0659 10.9424 1.1390 1.8493 29.1145 6.4106 5.1175 1.7799 1.2570 0.6879 95.1426 149.7404 25.3507 4.7122 16.1196 20.3086 14.5581 10.7500 4.5952 11.8209 26.0709 5.2209 10.1327 15.1444 341.5152 42.9074 12.2422 121.4636 98.0067 40.4974 40.3401 16.0057 15.1471 37.6394 35.7981 40.7178 32.9275 22.1733 21.6945 30.3535 43.9000 0.5300 19.3621 43.0952 23.6876
temp: 298.150 k
press: 1.00000 atm
elementType: 7 7 6 6 6 6 6 6 6 6 6 6 6 6 6 1 1 1 1 1 1 1 1 1 1 1 1 1 1 1 1 1 1
symmnumber: 1
zpe: 743147.0 jmol-1
zpe.correction: 0.283050 hartree
zpe.thermalcorrener: 0.297121 hartree
zpe.thermalcorrenthalpy: 0.298066 hartree
zpe.thermalcorrgfe: 0.242719 hartree
zpe.sumelectzpe: -614.547298 hartree
zpe.sumelectthermal: -614.533227 hartree
zpe.sumelectthermalent: -614.532283 hartree
zpe.sumelectthermalfe: -614.587629 hartree
dipole: -3.5997 0.1142 0.4992
dipole: 3.6359
quadrupole: -91.3618 -79.9554 -95.4016
quadrupole: 0.0542 0.8928 0.5112
quadrupole: -2.4556 8.9509 -6.4954 0.0542 0.8928 0.5112
hfenergy: -614.8303482 hartree
pointgroup: C01 [X(C13H18N2)]
dipole: 1.4194085 -0.037802 0.1736359 debye
polarizability: 210.0411216|-0.3614385|151.8509643|-6.3582703|-0.7208001|96.8950497 unknown
InChI: InChI=1S/C13H18N2/c1-14-11-7-3-4-8-12(11)15(2)13(14)9-5-6-10-13/h3-4,7-8H,5-6,9-10H2,1-2H3
charge 0 multiplicity 1
33 atoms
N  0.20991 1.10779 -0.363654
N  0.16401 -1.183298 -0.260875
C  1.135962 -0.053471 -0.166137
C  2.27523 -0.111786 -1.248233
C  1.911184 -0.011489 1.215334
C  3.621236 -0.243807 -0.488877
C  3.349063 0.442641 0.87776
C  -1.123571 0.708296 -0.141746
C  -1.151032 -0.720522 -0.087961
C  0.653172 2.484195 -0.192937
C  0.554929 -2.57132 -0.073137
C  -2.302166 1.458702 -0.011324
C  -2.357177 -1.416487 0.087933
C  -3.531524 0.753559 0.159406
C  -3.55848 -0.655213 0.206864
H  2.247384 0.822556 -1.837386
H  2.083271 -0.93499 -1.957086
H  1.939702 -1.035128 1.634846
H  1.390257 0.629181 1.947948
H  3.869399 -1.310435 -0.321751
H  4.465806 0.20963 -1.037238
H  3.396712 1.542872 0.764524
H  4.0829 0.158413 1.652894
H  1.641803 2.630896 -0.661571
H  0.722895 2.801194 0.87237
H  -0.055704 3.162057 -0.701067
H  -0.107034 -3.229172 -0.666627
H  0.50284 -2.907397 0.986884
H  1.586451 -2.726548 -0.433799
H  -2.290073 2.553622 -0.033523
H  -2.383371 -2.510059 0.141853
H  -4.462975 1.320716 0.265142
H  -4.511108 -1.177598 0.348872
