program: Gaussian 09
title: 000144151
version: EM64L-G09RevD.01
frameworkgroup: C1[X(C10H12)]
method: RPBEPBE
basis: SDD
operation: Freq
keyword: #p
keyword: freq=noraman
keyword: PBEPBE/SDD
title: #p freq=noraman PBEPBE/SDD
converged: NO NO NO NO
title: Mulliken charges:
elementType: C C C C C C C C C C H H H H H H H H H H H H
charge: -0.234517 -0.234519 -0.177260 -0.177272 -0.482719 -0.482722 -0.210222 -0.210209 -0.239265 -0.239273 0.263810 0.263814 0.216854 0.216857 0.227647 0.227658 0.227647 0.227657 0.204207 0.204204 0.203811 0.203813
chargesum: 0.00000
title: Mulliken charges with hydrogens summed into heavy atoms:
elementType: C C C C C C C C C C
charge: 0.029293 0.029294 0.039594 0.039585 -0.027414 -0.027418 -0.006015 -0.006006 -0.035454 -0.035460
polarizability: 1.20580397e+02 3.35657124e-05 1.01222623e+02 1.11845217e-03 1.15649239e-03 7.04569028e+01
1716.lowfreq: -10.8631 -0.0005 -0.0004 -0.0003 11.3034 18.5018 173.8443 180.2844 283.6864
frequency: 173.8436 180.2844 283.6864 316.0711 382.5711 413.6476 438.1492 586.3505 632.9083 637.1438 695.0102 746.9559 776.5677 829.7253 844.4357 867.2949 889.4871 911.4346 915.4673 919.5766 931.3929 969.5983 974.8118 981.7036 1002.5173 1016.4165 1020.7597 1071.4375 1112.5939 1126.9584 1160.2007 1168.7658 1177.1093 1207.5299 1211.2907 1219.0787 1251.4630 1253.9850 1269.3736 1276.0510 1341.6423 1372.1705 1379.1145 1427.0303 1470.6200 1485.8562 1623.9028 1646.8204 3000.4583 3000.5333 3008.2141 3013.4760 3057.1279 3079.3714 3084.6028 3093.7564 3096.5984 3104.5438 3113.6679 3129.0928
redmass: 3.7016 2.3317 3.0375 1.7070 5.6728 2.2972 4.8981 3.1129 5.4325 4.0079 1.4331 1.8967 2.3485 1.3801 2.0442 4.7439 3.2829 3.4676 3.8152 2.3801 1.9774 1.3468 3.3152 1.3062 1.7248 2.0025 1.3346 1.3404 1.2392 2.0069 1.6405 1.3651 1.3682 1.4401 1.7403 1.2224 1.0946 1.2368 1.4356 1.3905 1.3163 1.4477 1.4048 1.7386 1.0836 1.1027 8.1263 5.5191 1.0855 1.0578 1.0861 1.0621 1.1063 1.1059 1.0822 1.0860 1.0896 1.0959 1.0955 1.0984
irintensity: 0.0427 0.0000 0.1030 0.0000 0.0034 9.9973 0.8344 0.0000 0.0008 0.0437 87.9694 0.0000 2.3216 6.8356 0.0000 10.1185 1.9066 2.0126 0.6443 15.9315 0.2026 0.6220 2.6356 0.0000 0.0000 2.7194 0.0000 0.0000 3.0495 4.8530 0.0051 0.7080 0.0000 4.2414 2.7411 0.0000 2.3519 0.4033 10.0519 0.8142 0.2450 7.2575 3.8378 0.3474 2.4283 3.1381 10.4710 0.1183 57.9637 38.3103 16.4394 97.7037 0.0000 61.5499 1.0812 4.4817 68.5282 0.8920 71.4593 49.5339
temp: 298.150 k
press: 1.00000 atm
elementType: 6 6 6 6 6 6 6 6 6 6 1 1 1 1 1 1 1 1 1 1 1 1
symmnumber: 1
zpe: 498676.8 jmol-1
zpe.correction: 0.189936 hartree
zpe.thermalcorrener: 0.197410 hartree
zpe.thermalcorrenthalpy: 0.198354 hartree
zpe.thermalcorrgfe: 0.158311 hartree
zpe.sumelectzpe: -387.450219 hartree
zpe.sumelectthermal: -387.442746 hartree
zpe.sumelectthermalent: -387.441802 hartree
zpe.sumelectthermalfe: -387.481845 hartree
dipole: -0.7995 0.0000 0.0000
dipole: 0.7995
quadrupole: -57.5948 -56.4710 -62.6702
quadrupole: 0.0000 0.0002 -0.0004
quadrupole: 1.3172 2.4410 -3.7582 0.0000 0.0002 -0.0004
hfenergy: -387.6401554 hartree
pointgroup: C01[X(C10H12)]
dipole: -0.3145614 0.000011 0.000008 debye
dipolederiv: -0.0555525 0.0000244 0.0057734 0.0000482 -0.0215269 0.0000233 -0.0854117 0.000006 0.1935146 -0.0555345 -0.0000211 -0.0057219 -0.0000398 -0.0215218 0.0000241 0.0854404 0.0000062 0.1934574 -0.0062559 0.206711 -0.0000185 0.4047316 0.1325871 -0.0000619 0.0000687 0.0000038 -0.0056476 -0.0062711 -0.206703 0.0000139 -0.4047336 0.1326016 0.0000147 -0.0000564 0.0000653 -0.0056514 0.086095 0.0000052 0.0820343 -0.0000036 0.1890173 -0.0000034 -0.042257 -0.0000053 -0.0266498 0.0860967 0.0000001 -0.0820657 0.0000063 0.1890138 -0.0000036 0.0422372 -0.0000042 -0.0266443 0.2672336 -0.0755874 -0.0000092 -0.1014207 -0.020419 -0.0000476 0.000014 -0.0000872 -0.2284811 0.2672441 0.0755727 -0.0000436 0.1014188 -0.0204145 -0.0001034 -0.0000654 -0.0001509 -0.2284763 -0.0462227 -0.1772809 0.0000975 -0.1639355 0.0929205 -0.000056 0.0000955 -0.0000682 -0.1811331 -0.0462274 0.1772857 -0.0000881 0.1639345 0.0929018 -0.0000707 -0.0001096 -0.0000518 -0.1811366 -0.0055902 0.0000025 0.0704883 0.0000081 0.060286 -0.0000057 0.0133456 -0.0000223 -0.1569235 -0.0056116 -0.0000016 -0.0705333 -0.0000067 0.0602816 -0.0000092 -0.0133795 -0.0000224 -0.1568834 -0.0494349 -0.131058 0.000014 -0.0994059 -0.1402235 0.0000254 0.0000108 0.0000348 0.0641042 -0.0494235 0.1310474 0.000004 0.0994022 -0.1402312 0.0000097 0.0000171 0.000006 0.0641035 -0.031544 -0.0641127 -0.0662432 -0.1335327 -0.078038 -0.1027164 -0.0468895 -0.054286 0.0159878 -0.0315271 0.064106 -0.0662413 0.1335099 -0.0779968 0.1027184 -0.0468972 0.0542927 0.0159731 -0.0315245 0.0641046 0.0662523 0.1335123 -0.0780375 -0.1027438 0.0469015 -0.0543002 0.0159663 -0.0315171 -0.0640999 0.0662539 -0.1334942 -0.0779965 0.1027438 0.0469056 0.0543023 0.0159546 0.015356 0.0282648 -0.0000089 0.0735581 -0.1484155 0.0000674 -0.0000452 0.0000798 0.1548272 0.0153541 -0.0282651 0.0000249 -0.0735628 -0.1484213 0.0001063 0.0000543 0.00011 0.1548249 -0.1425714 0.0999873 -0.0000365 0.0810233 0.0118143 0.0000402 -0.0000397 0.0000365 0.1544558 -0.1425709 -0.0999822 0.0000537 -0.0810178 0.0118187 0.0000485 0.0000604 0.0000551 0.1544578 unknown
polarizability: 120.5803968|-0.0001817|101.2226217|-0.0017903|-0.0068618|70.4569044 unknown
InChI: InChI=1S/C10H12/c1-2-4-8-9-5-6-10(8)7(9)3-1/h1-4,7-10H,5-6H2
charge 0 multiplicity 1
22 atoms
C  -0.769673 -0.000079 -1.034466
C  -0.769469 0.00011 1.034585
C  -0.299249 -1.112083 0.000104
C  -0.299243 1.112117 -0.000107
C  -2.305346 0.000004 -0.790732
C  -2.305182 0.000047 0.791175
C  1.146622 -1.53865 0.000213
C  1.146652 1.538633 -0.000383
C  2.25563 -0.732407 0.000118
C  2.255645 0.73237 -0.000246
H  -0.398637 -0.000148 -2.068367
H  -0.398174 0.000191 2.068393
H  -0.942388 -2.012106 0.000233
H  -0.94234 2.012165 -0.000107
H  -2.79502 -0.894773 -1.214363
H  -2.795045 0.894718 -1.214459
H  -2.794765 0.894826 1.214908
H  -2.794815 -0.894663 1.214988
H  1.313107 -2.62485 0.000461
H  1.31315 2.624832 -0.000769
H  3.24221 -1.216587 0.000301
H  3.24223 1.216533 -0.000479
