program: Gaussian 09
title: 000144141
version: EM64L-G09RevD.01
frameworkgroup: C1[X(C12H14)]
method: RPBEPBE
basis: SDD
operation: Freq
keyword: #p
keyword: freq=noraman
keyword: PBEPBE/SDD
title: #p freq=noraman PBEPBE/SDD
converged: NO NO NO NO
title: Mulliken charges:
elementType: C C C C C C C C C C C C H H H H H H H H H H H H H H
charge: -0.228443 -0.228444 -0.283347 -0.283350 -0.283348 -0.283348 -0.372902 -0.372892 0.371977 0.122605 -0.786295 -0.786297 0.262653 0.262654 0.259672 0.259674 0.259674 0.259674 0.263281 0.263277 0.217007 0.217010 0.227746 0.217006 0.217010 0.227747
chargesum: 0.00000
title: Mulliken charges with hydrogens summed into heavy atoms:
elementType: C C C C C C C C C C C C
charge: 0.034210 0.034210 -0.023674 -0.023676 -0.023675 -0.023675 -0.109621 -0.109614 0.371977 0.122605 -0.124532 -0.124534
polarizability: 1.48077998e+02 5.66571524e-06 1.01229029e+02 6.01792460e-04 2.67889263e-04 9.50401434e+01
1716.lowfreq: -0.0006 -0.0006 -0.0005 17.6817 23.4233 38.7870 96.2103 125.0472 141.0741
frequency: 95.8154 125.0047 141.0681 186.3870 189.4914 309.0127 392.5887 394.1738 486.4459 575.1128 584.2564 613.0054 668.5456 717.1096 728.4117 757.9690 760.2101 761.1012 786.0476 794.0845 803.0103 894.3826 902.5224 903.8597 917.4491 948.9594 955.3239 956.2128 967.1061 968.5472 970.9022 981.4169 1015.5639 1057.7468 1060.5507 1063.2124 1073.1473 1080.1802 1093.3249 1095.0233 1164.7300 1185.1943 1201.3909 1214.3932 1226.0806 1226.9824 1237.0217 1279.6320 1296.3736 1320.1774 1334.0033 1385.9530 1397.1523 1456.7597 1466.8523 1471.7070 1474.9076 1734.6647 2951.5530 2955.6258 3019.0044 3021.2666 3080.4159 3084.1340 3096.4242 3100.7007 3134.5401 3137.7038 3140.4161 3145.6263 3155.4263 3170.1367
redmass: 3.0805 2.4023 1.0654 1.0906 3.2603 2.8303 2.6131 3.4662 3.2746 3.0880 3.1571 5.6117 6.1818 3.8116 4.6434 1.9307 2.2426 6.4761 1.8072 1.9425 5.0826 2.1216 1.7158 2.3070 2.3389 1.3797 2.4063 2.1374 1.5480 1.7013 1.8563 1.2716 2.0808 1.3201 1.2291 1.4339 1.2146 1.6147 1.5574 4.5630 1.4675 2.2430 1.6798 1.8757 1.3761 1.2740 3.0896 1.8542 2.3827 3.0510 2.6654 1.2519 1.2151 1.0496 1.0486 1.0446 1.0710 8.2783 1.0381 1.0380 1.0973 1.0966 1.0965 1.0963 1.0898 1.0910 1.0897 1.0909 1.0924 1.0929 1.0989 1.1044
irintensity: 1.3082 0.0000 0.0000 0.4198 0.0602 0.9018 5.1940 1.1981 0.4411 0.0137 0.0000 0.0000 0.2783 22.4092 0.1666 0.0001 11.2160 6.4796 40.7960 1.2138 4.9375 12.8602 2.4494 0.1122 12.0801 0.2870 0.2883 0.0000 0.0000 0.1762 8.8903 0.0000 5.4396 0.0000 1.1319 3.1404 0.0936 0.8870 21.2606 1.1233 0.7567 2.5675 0.0000 15.7365 0.0000 0.0112 0.1379 11.9088 0.7882 2.1374 1.0894 26.5757 3.1292 0.0000 12.5113 21.3244 2.0914 1.1833 28.8289 96.4451 0.0009 57.4841 13.2965 37.1718 43.2325 1.1716 0.6310 0.0015 40.4733 13.0988 63.4109 23.4226
temp: 298.150 k
press: 1.00000 atm
elementType: 6 6 6 6 6 6 6 6 6 6 6 6 1 1 1 1 1 1 1 1 1 1 1 1 1 1
symmnumber: 1
zpe: 580435.5 jmol-1
zpe.correction: 0.221076 hartree
zpe.thermalcorrener: 0.230709 hartree
zpe.thermalcorrenthalpy: 0.231654 hartree
zpe.thermalcorrgfe: 0.186497 hartree
zpe.sumelectzpe: -464.702001 hartree
zpe.sumelectthermal: -464.692368 hartree
zpe.sumelectthermalent: -464.691424 hartree
zpe.sumelectthermalfe: -464.736580 hartree
dipole: 0.1642 0.0000 0.0001
dipole: 0.1642
quadrupole: -68.9623 -70.3382 -69.4949
quadrupole: 0.0001 0.0003 -0.0002
quadrupole: 0.6361 -0.7397 0.1035 0.0001 0.0003 -0.0002
hfenergy: -464.9230776 hartree
pointgroup: C01 [X(C12H14)]
dipole: 0.0645829 -0.0000071 0.0000328 debye
dipolederiv: -0.1609277 0.0000265 0.0492016 -0.0000046 0.0567706 -0.000012 0.0086583 -0.0000092 0.0369789 -0.1609744 -0.0000322 -0.0492043 -0.0000011 0.0567271 -0.0000086 -0.0086337 -0.0000119 0.0369739 -0.0526488 0.0301433 0.0062648 0.0853603 -0.102721 0.019897 0.0526337 0.043869 0.0432983 -0.0526354 -0.0301352 0.00631 -0.085298 -0.1027981 -0.0197177 0.0527415 -0.0436963 0.0433771 -0.052639 0.0301256 -0.0062869 0.085333 -0.1027555 -0.0197448 -0.0527204 -0.0437015 0.0433639 -0.0526405 -0.0301308 -0.0062591 -0.0854027 -0.1026895 0.0199215 -0.0526258 0.043881 0.0432825 0.071662 -0.0253177 0.0000218 0.0692164 0.0754024 -0.0000211 -0.0000276 -0.0000286 0.0483407 0.0716792 0.0253235 -0.0000133 -0.0692069 0.0753946 -0.0000134 0.0000603 -0.0000111 0.0483473 0.3574252 -0.0000018 -0.0000125 0.0000021 -0.0366581 -0.000071 -0.0000807 -0.0000723 -0.1628362 0.1460849 -0.0000009 0.000014 0.0000041 0.2356931 -0.0002746 0.0000277 -0.0002744 -0.1681891 -0.0250655 -0.0428737 0.0000322 0.0306414 -0.0995613 0.0001588 -0.000004 0.0001589 0.1380285 -0.0250638 0.0428727 -0.0000351 -0.0306464 -0.0995642 0.0001584 0.0000037 0.0001657 0.1380308 -0.135429 -0.0000499 -0.0819153 -0.0000421 0.1361998 -0.0000815 -0.0717927 -0.0000823 0.003152 -0.1354133 0.0000504 0.0819239 0.0000423 0.1362087 -0.0000834 0.0717997 -0.0000828 0.0031373 0.078428 0.0463422 -0.0000592 0.0306878 0.0073935 -0.0882052 -0.0392553 -0.1057537 -0.0852287 0.078429 -0.0463398 -0.0000089 -0.0307362 0.0076327 0.0880885 -0.0392213 0.1056433 -0.0854713 0.0784275 0.0463514 -0.0000171 0.0307341 0.0076142 0.0881068 0.0392032 0.1056364 -0.0854559 0.0784285 -0.0463499 0.0000455 -0.0306856 0.0073799 -0.0882191 0.0392436 -0.1057506 -0.0852162 0.0414389 0.091611 -0.0000586 0.0670928 -0.1234152 0.0001181 -0.0000454 0.0001281 0.067142 0.0414343 -0.0916175 0.0000558 -0.0670954 -0.12341 0.000121 0.0000418 0.0001163 0.0671416 -0.0702003 -0.0457625 -0.108121 -0.049481 0.0706997 0.0269568 -0.1771843 -0.0308537 -0.0661769 -0.0701904 -0.0456226 0.1081757 -0.0492547 0.0707029 -0.0271317 0.1772388 0.0306769 -0.0661934 0.0453931 0.1509574 -0.0000954 0.080505 -0.0958246 0.0001154 -0.0000541 0.0001157 0.0882732 -0.0702136 0.0457675 0.1081234 0.0494822 0.0707 0.0269557 0.1771835 -0.0308557 -0.0661748 -0.0701803 0.0456215 -0.1081746 0.0492587 0.0707003 -0.0271301 -0.1772412 0.0306777 -0.0661984 0.0453915 -0.1509585 0.0000927 -0.0805055 -0.0958223 0.000116 0.0000508 0.0001151 0.0882729 unknown
polarizability: 148.0779984|-0.0001287|101.2290264|0.0003635|-0.0042364|95.0401463 unknown
InChI: InChI=1S/C12H14/c1-3(2)4-5-7-9-6(4)10-8(5)12(10)11(7)9/h5-12H,1-2H3
charge 0 multiplicity 1
26 atoms
C  -2.294692 -0.000448 -0.761595
C  -2.29463 0.000495 0.761641
C  -1.049398 -0.77621 -1.236458
C  -1.049403 0.774749 -1.237398
C  -1.04929 -0.774663 1.237363
C  -1.049287 0.776251 1.236413
C  -0.173238 -1.155389 0.000641
C  -0.173236 1.155447 -0.000776
C  0.855018 0.000014 -0.000106
C  2.21429 0.000019 -0.000075
C  3.038742 1.279313 -0.000906
C  3.038737 -1.27928 0.000809
H  -3.229945 -0.000797 -1.328358
H  -3.229835 0.000844 1.32848
H  -1.022146 -1.369268 -2.155071
H  -1.022178 1.366668 -2.156745
H  -1.021959 -1.36665 2.156659
H  -1.02197 1.369367 2.154981
H  0.201593 -2.187479 0.001297
H  0.201628 2.187526 -0.001423
H  3.700708 1.321316 0.888087
H  3.70065 1.320163 -0.889996
H  2.411252 2.186654 -0.00147
H  3.700717 -1.321287 -0.888175
H  3.700634 -1.320141 0.88991
H  2.41124 -2.186615 0.001371
