program: Gaussian 09
title: 000144138
version: EM64L-G09RevD.01
frameworkgroup: C1[X(C8H4Br2S3)]
method: RPBEPBE
basis: SDD
operation: Freq
keyword: #p
keyword: freq=noraman
keyword: PBEPBE/SDD
title: #p freq=noraman PBEPBE/SDD
converged: YES YES NO NO
title: Mulliken charges:
elementType: Br Br S S S C C C C C C C C H H H H
charge: 0.033108 0.033103 0.367007 0.344959 0.344857 -0.587724 -0.587510 -0.012250 -0.012338 -0.000444 -0.000440 -0.527980 -0.527992 0.282165 0.282149 0.284669 0.284664
chargesum: 0.00000
title: Mulliken charges with hydrogens summed into heavy atoms:
elementType: Br Br S S S C C C C C C C C
charge: 0.033108 0.033103 0.367007 0.344959 0.344857 -0.587724 -0.587510 0.269914 0.269810 -0.000444 -0.000440 -0.243311 -0.243328
polarizability: 2.69800872e+02 2.38768328e+01 1.29223420e+02 7.64094485e-02 5.56809777e-02 1.04601975e+02
1716.lowfreq: -7.9947 -3.7237 0.0021 0.0022 0.0023 3.1357 10.6521 14.6537 37.6016
frequency: 10.6115 14.5366 37.6015 104.9390 130.3277 157.0779 168.8342 214.3722 224.8950 265.9742 279.4829 294.1769 326.8026 394.9049 425.8489 447.9310 512.2134 583.6200 588.7483 616.9172 619.8525 732.1010 735.5526 740.1157 742.2370 818.8697 820.6514 857.2095 859.4051 924.8004 951.3705 1078.6067 1078.6919 1166.7794 1170.3499 1299.5887 1304.7503 1441.4849 1448.7345 1504.5355 1511.7462 3202.9293 3203.0151 3243.7425 3243.7969
redmass: 26.9980 22.6464 10.3618 20.9113 6.8796 7.8158 14.1916 7.6086 8.4050 10.9663 16.6864 13.2447 8.2267 9.5013 11.2170 5.8641 7.0208 3.4477 3.5257 9.5999 9.3023 1.3760 1.3040 6.4290 8.3900 5.9380 5.8443 1.3650 1.3915 8.1509 7.4271 1.5635 1.5592 1.2127 1.2238 3.1640 3.1572 9.5212 9.6667 6.7276 6.8817 1.0964 1.0964 1.0971 1.0971
irintensity: 0.0032 0.2234 0.0031 0.0621 1.3923 0.5044 0.5946 0.0166 0.2602 0.0136 2.0177 5.6883 0.5033 0.0153 3.0818 1.3514 8.4268 20.5672 31.4796 10.0946 0.1525 56.6267 54.0087 48.2338 2.5775 48.4031 3.1903 28.5411 21.9610 53.5590 0.5380 1.8916 7.6421 24.0592 7.0494 73.9484 3.4491 13.3486 0.7907 79.2764 2.2134 2.8329 0.7840 3.9815 3.3860
temp: 298.150 k
press: 1.00000 atm
elementType: 35 35 16 16 16 6 6 6 6 6 6 6 6 1 1 1 1
symmnumber: 1
zpe: 242248.2 jmol-1
zpe.correction: 0.092267 hartree
zpe.thermalcorrener: 0.105838 hartree
zpe.thermalcorrenthalpy: 0.106782 hartree
zpe.thermalcorrgfe: 0.046170 hartree
zpe.sumelectzpe: -1527.377408 hartree
zpe.sumelectthermal: -1527.363838 hartree
zpe.sumelectthermalent: -1527.362894 hartree
zpe.sumelectthermalfe: -1527.423505 hartree
dipole: 0.0016 0.0015 -0.5750
dipole: 0.5751
quadrupole: -120.4528 -110.6864 -115.4115
quadrupole: -2.2531 -0.0140 0.0180
quadrupole: -4.9359 4.8305 0.1054 -2.2531 -0.0140 0.0180
hfenergy: -1527.4696759 hartree
pointgroup: C01 [X(C8H4Br2S3)]
dipole: 0.0022067 -0.2262269 0.0015451 debye
dipolederiv: -0.4465646 0.0990672 0.2760641 0.1457454 -0.0380726 -0.0597322 0.3424151 -0.0503737 -0.246316 -0.444527 -0.1010429 0.2765608 -0.146901 -0.0399608 0.0606068 0.3436902 0.0521209 -0.2471818 0.1172388 -0.0009506 0.0085931 -0.0002592 0.2247823 -0.0016804 0.2053495 -0.000196 -0.0703614 -0.1666791 0.1128054 0.1907394 0.204831 0.0206356 0.0734515 0.192096 0.0909567 -0.2114072 -0.1625972 -0.1127193 0.1932683 -0.2050599 0.014089 -0.0738397 0.1957009 -0.0914613 -0.2090335 0.1386872 -0.2843154 0.0233334 -0.3319715 -0.1104118 -0.2795441 0.0207267 -0.2542838 0.2758715 0.1304464 0.2878609 0.0155852 0.3361169 -0.0949094 0.2843471 0.0130997 0.2589998 0.2692026 -0.3080915 0.0359106 0.1868555 0.0364755 -0.0497465 -0.0187396 0.1026822 -0.0228918 -0.2385879 -0.307939 -0.0372006 0.186997 -0.0388898 -0.050263 0.0190472 0.1027878 0.0219657 -0.2384361 0.7120921 -0.2068709 -0.5551605 -0.2559086 0.0027169 0.1733065 -0.6379725 0.1000175 0.3093699 0.7080812 0.2093742 -0.5551099 0.2577957 0.0054646 -0.1765026 -0.6392318 -0.1043243 0.3114003 -0.2313987 -0.056145 -0.1534011 0.0853667 -0.205857 -0.0368759 -0.1754659 -0.0107189 -0.0209341 -0.2302693 0.053873 -0.1548896 -0.0879188 -0.205672 0.0371831 -0.1748996 0.0108238 -0.0218951 0.170712 0.0295744 0.0145498 0.0456996 0.1277714 0.048522 -0.0107469 0.0638245 0.0456799 0.1715166 -0.0286395 0.0158351 -0.0451057 0.1253267 -0.0495072 -0.0090495 -0.0650067 0.047088 0.0736446 0.089332 0.0141324 0.0790047 0.1387241 0.0530681 0.0638013 0.0312501 0.1221658 0.0756473 -0.0899133 0.016047 -0.079021 0.1353825 -0.0531106 0.0650168 -0.0307026 0.123375 unknown
polarizability: 247.6701013|0.6000142|104.6059159|-56.4911574|-0.0420235|151.3502497 unknown
InChI: InChI=1S/C8H4Br2S3/c9-5-1-7(11-3-5)13-8-2-6(10)4-12-8/h1-4H
charge 0 multiplicity 1
17 atoms
Br 4.889529 -0.764259 -1.773424
Br -4.881395 -0.807414 1.778898
S  -0.01244 1.864715 -0.01033
S  1.771834 -0.302458 1.46834
S  -1.764994 -0.344969 -1.464032
C  1.402076 0.726273 0.021867
C  -1.411041 0.70664 -0.029899
C  2.36618 0.587373 -0.964916
C  -2.374858 0.567299 0.957095
C  3.402427 -0.343026 -0.591874
C  -3.398114 -0.381362 0.594286
C  3.247076 -0.920596 0.654649
C  -3.232869 -0.972707 -0.644474
H  2.333468 1.113805 -1.919876
H  -2.350728 1.10614 1.905369
H  3.870276 -1.661147 1.150947
H  -3.845227 -1.727908 -1.132126
