program: Gaussian 09
title: 000144136
version: EM64L-G09RevD.01
frameworkgroup: C1[X(C9H11NO2)]
method: RPBEPBE
basis: SDD
operation: Freq
keyword: #p
keyword: freq=noraman
keyword: PBEPBE/SDD
title: #p freq=noraman PBEPBE/SDD
converged: NO YES NO NO
title: Mulliken charges:
elementType: O O N C C C C C C C C C H H H H H H H H H H H
charge: -0.226971 -0.168426 -0.179856 -0.060600 -0.675252 -0.675006 0.108712 -0.104352 0.191332 -0.275185 -0.247569 -0.185341 0.278039 0.229030 0.203042 0.244287 0.244451 0.228875 0.203163 0.251348 0.239775 0.237630 0.138874
chargesum: 0.00000
title: Mulliken charges with hydrogens summed into heavy atoms:
elementType: O O N C C C C C C C C C
charge: -0.226971 -0.168426 -0.179856 0.217439 0.001106 0.001483 0.108712 0.146996 0.191332 -0.035410 -0.009939 -0.046467
polarizability: 1.51733526e+02 -5.47972902e+00 1.24969591e+02 5.83710508e-03 4.04918182e-02 6.32981386e+01
1716.lowfreq: -13.5313 -6.9373 -4.5594 0.0006 0.0008 0.0010 24.1201 52.6617 104.4993
frequency: 23.3349 52.6392 104.4987 160.9683 173.5844 217.3400 231.9021 253.5537 278.8794 279.3005 363.5580 412.2112 434.6156 506.1709 515.3444 528.5805 541.7815 635.6046 665.9901 753.4015 781.1229 806.4564 878.8111 926.9191 930.2255 931.0951 945.6274 952.3263 984.8392 1042.0459 1080.5747 1115.5962 1149.1987 1175.5443 1181.1496 1224.5562 1266.8588 1337.5723 1353.8448 1386.2778 1390.6594 1403.5672 1420.5324 1456.0796 1464.7548 1470.7476 1481.1302 1483.9380 1545.7985 1570.6197 1602.8702 1661.2932 2809.1684 2982.1755 2984.0239 3039.3744 3073.9867 3085.1939 3095.3206 3098.8405 3112.3490 3156.2878 3194.7931
redmass: 2.8580 9.9313 3.4787 5.6156 3.1284 1.0862 1.3882 2.2791 2.7127 2.9716 3.6335 5.5139 3.7677 6.2402 4.2318 3.7579 2.7803 6.9626 3.5003 3.5086 1.5482 5.1921 3.9584 1.2807 3.4887 1.3829 1.4637 1.3110 1.6749 3.2421 2.1543 1.6257 2.5891 1.4957 2.0832 2.5033 1.7267 2.5061 1.3165 1.2023 1.3823 1.2147 1.3125 2.1902 1.0477 1.0484 1.0724 1.0645 6.5786 6.7441 7.1760 8.0613 1.0819 1.0369 1.0384 1.0848 1.0986 1.0966 1.1005 1.1002 1.0906 1.0896 1.0981
irintensity: 1.3192 0.9897 5.7535 5.8916 2.3317 0.4893 0.0656 0.3239 5.5970 1.7342 0.8696 2.6207 4.3937 2.8555 3.4272 9.3194 4.6602 17.9619 14.1986 47.8576 27.2271 6.2926 7.2465 0.7213 22.2821 1.5834 0.1111 0.0308 4.0703 0.4449 26.7767 35.6905 11.5413 1.7035 54.3024 55.4878 52.0070 1.1436 1.3538 21.4691 33.1539 12.4542 34.4117 31.2859 0.4864 5.5079 13.0837 25.0607 300.1362 32.4561 91.3883 326.3953 156.9265 16.9620 28.3416 13.6456 2.9273 50.4681 13.4419 34.3469 13.1549 3.4287 7.6387
temp: 298.150 k
press: 1.00000 atm
elementType: 8 8 7 6 6 6 6 6 6 6 6 6 1 1 1 1 1 1 1 1 1 1 1
symmnumber: 1
zpe: 479507.6 jmol-1
zpe.correction: 0.182635 hartree
zpe.thermalcorrener: 0.194428 hartree
zpe.thermalcorrenthalpy: 0.195372 hartree
zpe.thermalcorrgfe: 0.143994 hartree
zpe.sumelectzpe: -553.858503 hartree
zpe.sumelectthermal: -553.846711 hartree
zpe.sumelectthermalent: -553.845767 hartree
zpe.sumelectthermalfe: -553.897145 hartree
dipole: -5.1807 6.0315 0.0049
dipole: 7.9510
quadrupole: -70.0757 -74.1215 -71.3486
quadrupole: 12.9393 0.0190 0.0014
quadrupole: 1.7729 -2.2728 0.5000 12.9393 0.0190 0.0014
hfenergy: -554.0411382 hartree
pointgroup: C01 [X(C9H11N1O2)]
dipole: 2.0900731 -2.3274393 0.00127 debye
dipolederiv: -0.3695188 -0.083108 -0.000245 -0.077953 -1.1208732 -0.0002515 -0.0001927 -0.0019177 -0.3199962 -0.7390663 0.246835 -0.0004389 0.604714 -0.7180819 0.0006205 -0.0004463 0.0003794 -0.3086654 -0.3500081 0.3220432 0.0004373 -0.7154079 -0.7479177 -0.0019201 0.0000422 -0.0002801 -0.2333426 0.5270984 0.1850597 0.0002981 0.4957698 0.1859802 0.0011453 -0.0006254 0.0004311 0.3115879 -0.0663973 -0.0393432 0.0212203 -0.0857179 0.0892755 -0.0224264 -0.0000699 -0.0248874 -0.0786247 -0.0662397 -0.0393814 -0.0205759 -0.0853924 0.0894573 0.0214674 0.0012142 0.0241864 -0.0792882 0.3724949 -0.1000651 0.0001528 -0.0197656 1.3439722 0.0007926 0.0008522 0.001913 0.1906509 0.3471534 0.0086592 0.0005303 0.9673216 0.4437134 0.0018168 0.0006248 0.0003437 0.0035706 -0.8672187 -0.0556384 -0.0012451 0.4986641 -0.6069106 0.0003572 -0.0006974 -0.0004231 -0.02502 -0.997405 0.0743527 -0.0011624 -0.1973265 -0.0551725 -0.0004075 -0.0011149 -0.0000624 -0.2564744 0.6218285 -0.1088705 0.0008852 -0.5838562 0.3909742 -0.0007867 0.0007659 0.0001959 -0.0684471 1.5354923 -0.3115709 0.0018478 -0.4970745 0.8659954 -0.0002925 0.0016505 -0.0000547 0.0956528 0.157043 0.0786226 -0.0001 -0.0659989 0.0178523 0.000206 -0.0000462 0.0002716 0.045361 -0.0910533 -0.1181407 0.0271284 -0.1339651 0.0015179 0.0010191 0.0230829 -0.0141669 0.0952592 0.0752354 0.053253 0.0267301 0.1071417 -0.125627 -0.0243105 0.0030495 0.0450317 0.0594098 0.0416773 0.033859 -0.1137296 0.0356698 0.0890821 0.0125897 -0.0801993 0.0100054 -0.0813867 0.0403787 0.0345394 0.1143971 0.0359298 0.0889335 -0.0132511 0.0809571 -0.0102225 -0.0794775 -0.09123 -0.1184772 -0.0279856 -0.1339015 0.0017902 -0.0015284 -0.0242029 0.0135764 0.0948284 0.0754558 0.0531776 -0.0270196 0.1064233 -0.1257304 0.0258746 -0.003359 -0.0439043 0.059244 -0.0442268 0.0719939 -0.0003409 0.0602 0.084949 -0.0000553 -0.0002438 0.0000803 0.1483927 0.0659877 0.0334748 -0.0001552 0.0302494 -0.0653657 -0.0000346 -0.0001343 0.000001 0.1869898 -0.0388899 -0.1276931 -0.000251 -0.0755315 0.0530852 -0.0001278 -0.0003635 -0.0000985 0.1445076 -0.1385916 -0.0935818 -0.0003782 -0.2701924 -0.1808994 -0.0004969 -0.0005435 -0.0003984 0.0952682 unknown
polarizability: 151.9620035|-4.8842912|124.7409052|0.1244326|0.0544699|63.2983471 unknown
InChI: InChI=1S/C9H11NO2/c1-7(2)10-5-3-4-8(6-11)9(10)12/h3-7H,1-2H3
charge 0 multiplicity 1
23 atoms
O  -0.401573 1.850277 0.001443
O  -3.32544 1.389328 -0.004652
N  0.910953 -0.107881 0.000068
C  2.145895 0.75488 0.003042
C  2.971835 0.531862 -1.281006
C  2.961436 0.536531 1.294575
C  -0.3837 0.587384 -0.001617
C  1.023732 -1.473156 -0.000175
C  -1.546039 -0.314625 -0.00306
C  -0.090923 -2.309514 -0.002021
C  -1.377025 -1.707687 -0.003379
C  -2.938457 0.193649 -0.004258
H  1.742625 1.782737 -0.000331
H  3.814168 1.245646 -1.305728
H  3.39765 -0.487974 -1.331556
H  2.355157 0.698596 -2.18095
H  2.337743 0.707738 2.188815
H  3.804458 1.249371 1.323113
H  3.38534 -0.483699 1.352616
H  2.03998 -1.878658 0.001215
H  0.040994 -3.392789 -0.002109
H  -2.27435 -2.341358 -0.004561
H  -3.688958 -0.644858 -0.005985
