program: Gaussian 09
title: 000144123
version: EM64L-G09RevD.01
frameworkgroup: C1[X(C9H16)]
method: RPBEPBE
basis: SDD
operation: Freq
keyword: #p
keyword: freq=noraman
keyword: PBEPBE/SDD
title: #p freq=noraman PBEPBE/SDD
converged: YES YES NO NO
title: Mulliken charges:
elementType: C C C C C C C C C H H H H H H H H H H H H H H H H
charge: 0.355761 -0.559652 -0.559653 0.234730 0.234729 -0.768494 -0.748638 -0.819026 -0.819026 0.206343 0.210150 0.210150 0.206344 0.209418 0.209418 0.213442 0.207675 0.207675 0.229842 0.222460 0.221371 0.225574 0.225574 0.221371 0.222460
chargesum: 0.00000
title: Mulliken charges with hydrogens summed into heavy atoms:
elementType: C C C C C C C C C
charge: 0.355761 -0.143159 -0.143159 0.234730 0.234729 -0.136216 -0.103445 -0.149621 -0.149621
polarizability: 1.02212906e+02 -8.45314147e-06 1.04832210e+02 1.35382156e+00 5.50475948e-06 7.71634835e+01
1716.lowfreq: -18.6238 -0.0008 -0.0006 0.0005 6.9978 11.2790 72.5793 127.1116 139.8094
frequency: 72.5789 127.1058 139.8031 155.7956 219.9227 245.0201 272.3531 276.8872 280.3935 320.4005 338.0116 406.5088 446.4107 481.8047 528.4101 577.7255 725.3683 778.5960 885.8479 889.0205 913.7714 928.8314 931.3381 952.5363 973.3697 1002.4282 1008.2866 1039.6746 1090.7010 1113.4632 1152.4410 1171.6487 1219.8453 1221.4238 1230.9530 1271.2907 1305.7463 1322.9503 1370.9713 1388.3868 1389.8617 1399.9229 1458.0366 1458.9342 1460.6289 1463.3906 1463.9752 1469.0394 1473.9846 1476.1044 1480.0240 1483.0666 1703.5587 2941.0707 2944.5261 2954.6608 2957.1059 2961.8156 2966.9870 2993.4040 2995.6583 3021.6808 3022.2884 3055.2872 3061.6000 3062.5288 3068.0578 3071.9218 3076.1892
redmass: 2.5582 1.0274 2.3405 1.0319 1.1682 1.2539 2.4672 2.4109 1.4496 2.4015 2.0494 1.9628 2.2450 2.3172 3.5350 3.9512 3.1874 3.7698 1.8689 1.8853 1.7228 1.7127 1.3899 1.6572 1.3919 1.3429 1.3330 1.4620 2.1426 1.5055 1.3390 1.7618 4.1504 1.7767 2.2748 2.2384 2.2380 2.8618 1.2113 1.2124 1.3842 1.2285 1.0693 1.0721 1.0508 1.0469 1.0509 1.0497 1.0834 1.0676 1.0584 1.0562 6.9023 1.0612 1.0610 1.0385 1.0388 1.0349 1.0363 1.0978 1.0981 1.0965 1.0964 1.0995 1.0997 1.0989 1.0992 1.0976 1.0957
irintensity: 0.0118 1.0410 0.0001 0.0224 0.1447 0.2872 1.4748 7.6418 0.3342 0.1191 0.3843 0.1784 0.3233 0.0006 0.0469 1.3857 0.0057 0.0732 0.3314 1.5296 0.7897 0.5518 1.3185 2.0516 4.2147 1.0359 0.1120 0.0016 3.8018 1.1065 1.0350 4.9027 0.9109 20.5174 0.1626 5.6576 20.5903 1.5054 23.4357 8.0493 8.0418 14.2989 3.3495 0.2120 1.2060 27.8524 0.0283 13.1377 10.9200 4.6189 5.7307 8.7973 0.7224 65.7591 29.3293 87.8415 37.6228 41.9714 31.2628 17.3775 43.0649 0.0062 58.0213 3.6713 39.7158 64.5689 48.3131 28.1772 43.6001
temp: 298.150 k
press: 1.00000 atm
elementType: 6 6 6 6 6 6 6 6 6 1 1 1 1 1 1 1 1 1 1 1 1 1 1 1 1
symmnumber: 1
zpe: 586848.0 jmol-1
zpe.correction: 0.223519 hartree
zpe.thermalcorrener: 0.234342 hartree
zpe.thermalcorrenthalpy: 0.235286 hartree
zpe.thermalcorrgfe: 0.188384 hartree
zpe.sumelectzpe: -351.823517 hartree
zpe.sumelectthermal: -351.812693 hartree
zpe.sumelectthermalent: -351.811749 hartree
zpe.sumelectthermalfe: -351.858651 hartree
dipole: 0.1394 0.0000 -0.0712
dipole: 0.1565
quadrupole: -57.1659 -55.9369 -58.5367
quadrupole: 0.0000 0.0570 0.0000
quadrupole: 0.0472 1.2763 -1.3235 0.0000 0.0570 0.0000
hfenergy: -352.0470353 hartree
pointgroup: C01 [X(C9H16)]
dipole: 0.0548887 0.0000017 0.0279022 debye
dipolederiv: 0.170373 0.0000086 -0.0226107 0.0000077 0.0054232 -0.0000058 0.0005098 -0.0000049 0.1491072 -0.1307179 0.0928969 0.0255881 0.0506317 0.029896 0.0264586 0.0263656 0.0520792 0.1654498 -0.1307039 -0.092914 0.0255843 -0.0506489 0.0298865 -0.0264656 0.0263684 -0.0520859 0.1654441 0.1507903 -0.1024195 -0.0173724 -0.0143244 0.1211941 0.0008008 -0.051988 -0.0443449 -0.1604582 0.150779 0.1024234 -0.017367 0.0143307 0.1212025 -0.0007836 -0.0519932 0.0443567 -0.1604549 -0.0187509 -0.0000071 0.0479749 -0.0000072 0.093297 0.0000055 0.0558519 0.0000058 0.0021229 0.0107445 -0.0000039 -0.0157158 -0.0000048 0.1005454 0.0000056 0.0038907 0.0000069 -0.0842053 -0.0842007 0.0395608 0.0132331 0.0666811 -0.0067568 -0.0109453 0.016862 -0.0007945 0.1207523 -0.0841912 -0.0395687 0.01323 -0.0666896 -0.0067684 0.0109377 0.0168589 0.0007897 0.1207526 0.0223553 -0.069244 -0.0127272 -0.0509314 -0.1017349 -0.0997648 -0.0451371 -0.1578887 -0.0169354 0.0120237 -0.0592241 0.0087676 -0.0197302 -0.0021245 0.0796634 0.0390288 0.1483655 -0.1470826 0.0120161 0.0592247 0.008779 0.0197288 -0.0021009 -0.0796521 0.0390441 -0.1483513 -0.1470987 0.0223441 0.0692574 -0.012732 0.0509464 -0.1017404 0.0997572 -0.0451487 0.1578778 -0.0169166 -0.0373935 0.0918177 0.00472 0.1657121 -0.0845454 0.0179541 -0.0233114 0.0525181 0.0740995 -0.0373702 -0.0918139 0.0047146 -0.1657062 -0.0845636 -0.0179657 -0.0233192 -0.0525322 0.0740943 0.0522436 0.0000024 -0.0901873 0.0000001 0.0771564 0.0000057 -0.0315822 0.0000082 -0.1774742 -0.0083781 -0.1020611 -0.0576626 -0.1473534 -0.0881649 -0.0687138 -0.0341426 -0.0093983 0.055683 -0.0084029 0.1020734 -0.0576622 0.1473641 -0.0881465 0.0686978 -0.034133 0.0093846 0.0556888 -0.0472551 -0.0000117 0.1575464 -0.0000101 0.0723304 0.0000111 0.1137863 0.0000088 -0.0220331 0.0717289 0.0393424 0.0264815 0.0512586 -0.042536 0.1048311 -0.0369086 0.1594289 -0.0626138 -0.1490974 -0.047861 0.0172076 -0.1357075 0.0453474 0.0129987 0.0248621 0.0041902 0.0955889 0.0692182 0.0087719 -0.0467403 0.0293389 -0.0449572 -0.1103996 0.0131389 -0.1606498 -0.0582425 0.069222 -0.0087617 -0.0467496 -0.0293305 -0.0449762 0.1103952 0.0131233 0.1606515 -0.0582275 -0.149115 0.0478418 0.0172093 0.135688 0.0453658 -0.0129978 0.0248685 -0.0041898 0.0955883 0.0717383 -0.0393307 0.0264905 -0.051244 -0.042529 -0.1048282 -0.0368951 -0.1594318 -0.0626286 unknown
polarizability: 102.2081564|-0.000069|104.8322099|-1.397062|0.0008691|77.168233 unknown
InChI: InChI=1S/C9H16/c1-7-5-9(3,4)6-8(7)2/h5-6H2,1-4H3
charge 0 multiplicity 1
25 atoms
C  -1.33125 -0.000053 -0.00955
C  -0.388516 -1.230043 0.239461
C  -0.388632 1.23001 0.239547
C  1.025498 -0.683272 0.061646
C  1.025433 0.683385 0.061693
C  -2.562329 -0.000144 0.924114
C  -1.793102 -0.000023 -1.490891
C  2.203026 -1.620364 -0.043207
C  2.202873 1.620595 -0.043098
H  -0.609829 -2.065303 -0.456338
H  -0.519792 -1.635858 1.266123
H  -0.519945 1.635738 1.266239
H  -0.610026 2.065297 -0.456191
H  -3.192511 0.893426 0.751796
H  -3.19243 -0.893758 0.751728
H  -2.25585 -0.000171 1.987197
H  -2.404292 -0.895044 -1.714941
H  -2.40438 0.894955 -1.714876
H  -0.92121 0.000045 -2.171405
H  2.264501 -2.282239 0.844208
H  3.16461 -1.085641 -0.13103
H  2.104988 -2.286851 -0.923643
H  2.104781 2.28712 -0.923499
H  3.164508 1.085968 -0.13094
H  2.264277 2.282427 0.844353
