program: Gaussian 09
title: 000144105
version: EM64L-G09RevD.01
frameworkgroup: C1[X(C10H24N3P)]
method: RPBEPBE
basis: SDD
operation: Freq
keyword: #p
keyword: freq=noraman
keyword: PBEPBE/SDD
title: #p freq=noraman PBEPBE/SDD
converged: YES YES NO NO
title: Mulliken charges:
elementType: P N N N C C C C C C C C C C H H H H H H H H H H H H H H H H H H H H H H H H
charge: 0.943019 -0.530103 -0.503408 -0.465866 -0.313681 -0.342276 0.006353 0.030057 -0.596627 -0.596578 -0.690127 -0.689449 -0.688297 -0.686806 0.204292 0.211650 0.197535 0.218769 0.199876 0.236771 0.220341 0.208253 0.224441 0.223117 0.196802 0.223123 0.199809 0.224931 0.222662 0.226314 0.203694 0.214749 0.206651 0.201216 0.227074 0.219180 0.207295 0.205242
chargesum: 0.00000
title: Mulliken charges with hydrogens summed into heavy atoms:
elementType: P N N N C C C C C C C C C C
charge: 0.943019 -0.530103 -0.503408 -0.465866 0.102261 0.074028 0.206230 0.266828 0.056409 0.046463 -0.042725 -0.044691 -0.053355 -0.055089
polarizability: 1.72652557e+02 -2.83164994e-01 1.51950219e+02 1.92926312e+00 1.11047068e+00 1.37945827e+02
1716.lowfreq: -9.5121 -0.0018 -0.0009 0.0007 1.5047 12.3840 32.1396 42.1447 63.3943
frequency: 31.9148 41.8067 63.3908 78.3661 91.5761 109.5852 124.5356 163.4997 173.4700 183.0981 201.8990 211.9266 214.5538 225.6265 237.0354 250.9026 257.1935 270.7155 286.4241 323.3132 346.5627 355.4145 387.6249 443.6495 475.4681 485.5299 492.2709 551.3412 581.9926 592.3967 618.4574 834.4118 844.2681 845.8404 902.7896 906.6051 909.2946 924.0451 927.2562 931.7998 1001.6135 1017.5989 1034.7050 1072.3856 1107.3336 1119.2039 1122.6157 1126.0591 1136.7058 1138.5718 1153.7849 1159.1758 1176.3748 1190.5214 1194.0038 1215.0950 1233.4014 1239.4023 1301.2795 1307.1233 1326.4606 1346.2368 1348.8452 1365.3561 1366.7375 1368.1053 1383.2622 1383.6004 1430.0732 1430.1884 1455.8922 1457.2615 1461.4895 1462.4380 1467.5348 1471.4825 1472.3384 1474.6155 1475.6208 1481.3804 1482.7654 1487.1852 1489.9387 1494.5189 2876.6576 2884.8233 2892.8131 2898.3199 2967.8858 2968.2842 2972.7629 2973.6457 2989.1772 2991.8744 2992.6961 2997.0643 3000.8914 3004.4931 3057.8967 3060.5449 3063.5007 3063.7204 3068.0075 3071.8556 3073.9817 3077.9903 3084.4241 3084.8384
redmass: 3.2448 2.5738 2.9878 2.8102 2.7911 2.9909 2.8606 2.5287 1.5106 1.4375 1.9115 1.2178 1.5240 1.0726 1.3862 1.6807 1.1771 2.2421 2.1327 2.7503 2.6711 3.2235 2.5182 4.3989 4.0838 4.0756 2.7583 4.9955 3.0502 2.8743 5.8973 2.9497 2.0923 1.7625 1.3760 2.1776 1.2358 1.5142 1.3389 2.0624 1.8985 1.9405 2.3942 1.4652 1.2628 1.8404 1.4162 2.2772 1.6126 2.3734 1.9981 2.0977 2.6442 1.8388 2.4701 2.4937 5.1848 1.5083 1.3479 1.3521 1.3855 1.3201 1.3842 1.2196 1.2130 1.2120 1.2130 1.2128 1.1435 1.1417 1.0532 1.0484 1.0485 1.0461 1.0514 1.0505 1.0476 1.0583 1.0654 1.0637 1.0689 1.0525 1.0554 1.0555 1.0611 1.0630 1.0578 1.0569 1.0347 1.0349 1.0359 1.0353 1.0841 1.0913 1.0797 1.0843 1.0839 1.0920 1.0992 1.0981 1.0980 1.0980 1.0981 1.0988 1.0997 1.1005 1.0997 1.1000
irintensity: 0.2519 0.0088 0.9311 0.0497 0.1085 2.0215 4.7130 0.1289 2.8120 1.8498 6.3798 0.2237 0.4603 0.4579 2.4789 1.4188 0.1964 1.1610 0.7306 0.1279 8.0315 1.4385 1.4806 2.6884 39.2332 12.5948 9.7769 33.1137 0.9244 6.5939 64.4125 49.5285 5.2691 17.6231 12.5800 67.9470 2.7699 3.0131 2.3931 25.5102 14.5238 5.9960 45.2964 0.4236 7.5503 49.6199 0.2184 6.8296 1.0461 16.4997 92.0060 38.3156 59.1661 26.9340 60.7479 14.6958 21.4560 23.1343 4.7503 1.1532 0.1304 13.8166 0.7865 10.8662 13.3244 27.5232 18.0907 19.8223 3.3986 5.6919 11.8690 3.2071 6.0195 8.8656 3.4635 0.4453 15.6041 9.5062 4.9848 8.6049 7.2114 13.1894 3.2675 8.5909 63.5132 146.7723 22.7416 264.9789 6.1396 48.0338 35.8043 35.0752 20.4906 81.6254 69.9569 42.8251 4.8399 62.9502 0.2090 31.9803 16.2395 16.7433 97.3442 85.7060 30.2814 29.3703 69.3426 17.1452
temp: 298.150 k
press: 1.00000 atm
elementType: 15 7 7 7 6 6 6 6 6 6 6 6 6 6 1 1 1 1 1 1 1 1 1 1 1 1 1 1 1 1 1 1 1 1 1 1 1 1
symmnumber: 1
zpe: 875943.3 jmol-1
zpe.correction: 0.333629 hartree
zpe.thermalcorrener: 0.352437 hartree
zpe.thermalcorrenthalpy: 0.353381 hartree
zpe.thermalcorrgfe: 0.287389 hartree
zpe.sumelectzpe: -899.746342 hartree
zpe.sumelectthermal: -899.727535 hartree
zpe.sumelectthermalent: -899.726591 hartree
zpe.sumelectthermalfe: -899.792583 hartree
dipole: 0.0886 -0.2101 1.1777
dipole: 1.1995
quadrupole: -92.1516 -94.0920 -98.5379
quadrupole: -1.4243 2.2768 1.1403
quadrupole: 2.7756 0.8351 -3.6107 -1.4243 2.2768 1.1403
hfenergy: -900.0799717 hartree
pointgroup: C01 [X(C10H24N3P1)]
dipole: 0.0443953 -0.3636692 0.2974842 debye
polarizability: 171.4350093|1.9435944|144.7077449|4.8476129|7.6608152|146.405848 unknown
InChI: InChI=1S/C10H24N3P/c1-9(2)13(10(3)4)14-11(5)7-8-12(14)6/h9-10H,7-8H2,1-6H3
charge 0 multiplicity 1
38 atoms
P  0.601673 1.01244 -0.56914
N  -0.752394 -0.124661 -0.234621
N  1.952288 -0.191047 -0.717655
N  1.399356 1.563428 0.966791
C  3.074463 0.047567 0.2092
C  2.438225 0.649009 1.477069
C  -2.117853 0.256796 -0.709785
C  -0.607995 -1.352399 0.594423
C  2.280779 -0.74405 -2.035219
C  0.662138 2.369319 1.93892
C  -2.196571 0.316428 -2.256335
C  -2.634929 1.575088 -0.075137
C  -1.032392 -2.628773 -0.176199
C  -1.341244 -1.250211 1.95655
H  3.823253 0.759583 -0.212122
H  3.593833 -0.907176 0.43006
H  2.023967 -0.155018 2.132285
H  3.185699 1.214085 2.068227
H  -2.793792 -0.554023 -0.37347
H  0.480397 -1.439705 0.776808
H  2.76466 -1.733942 -1.919476
H  2.967384 -0.096925 -2.630302
H  1.355264 -0.891287 -2.620387
H  1.362092 2.99807 2.524178
H  0.065514 1.761939 2.661743
H  -0.037515 3.043297 1.412147
H  -3.229557 0.528863 -2.592696
H  -1.536707 1.112996 -2.645866
H  -1.874148 -0.644624 -2.695113
H  -2.574141 1.52633 1.026796
H  -3.687643 1.763059 -0.361483
H  -2.02968 2.434644 -0.418855
H  -0.82958 -3.530278 0.432507
H  -2.112445 -2.627045 -0.416684
H  -0.46539 -2.707473 -1.120361
H  -0.995498 -0.36559 2.521666
H  -1.151378 -2.152156 2.56908
H  -2.436235 -1.164756 1.819856
