program: Gaussian 09
title: 000144101
version: EM64L-G09RevD.01
frameworkgroup: C1[X(C5H10BrF2O3P)]
method: RPBEPBE
basis: SDD
operation: Freq
keyword: #p
keyword: freq=noraman
keyword: PBEPBE/SDD
title: #p freq=noraman PBEPBE/SDD
converged: YES YES NO NO
title: Mulliken charges:
elementType: Br P F F O O O C C C C C H H H H H H H H H H
charge: 0.104317 1.313105 -0.117834 -0.142619 -0.504974 -0.517838 -0.589446 -0.111462 -0.228489 -0.212119 -0.650465 -0.652542 0.229480 0.243184 0.227987 0.238639 0.214578 0.228935 0.238324 0.212842 0.238134 0.238263
chargesum: 0.00000
title: Mulliken charges with hydrogens summed into heavy atoms:
elementType: Br P F F O O O C C C C C
charge: 0.104317 1.313105 -0.117834 -0.142619 -0.504974 -0.517838 -0.589446 -0.111462 0.244175 0.254506 0.031372 0.036697
polarizability: 1.08287811e+02 3.71877637e+00 1.10121473e+02 -1.11554780e+01 -1.78392803e+00 1.03958093e+02
1716.lowfreq: -37.9262 -12.2008 -7.5796 -4.7067 -0.0014 0.0007 0.0012 17.1208 21.3220
frequency: -37.4480 16.8382 21.1223 41.4198 52.1808 61.4163 108.7215 129.7784 164.9737 192.7766 225.3283 236.7253 244.6283 246.9078 271.6713 295.7022 296.2797 326.9412 359.6015 449.7020 472.0239 535.2485 647.4744 702.7144 781.3434 804.7481 811.0402 868.4040 887.4816 956.4355 987.6245 1010.7297 1020.3463 1043.0415 1104.0773 1107.6871 1131.5110 1135.0976 1252.4091 1254.0462 1353.8028 1355.1181 1394.2553 1396.3934 1457.3481 1457.8259 1476.8841 1477.9744 1487.1313 1489.5788 2995.0054 2995.9764 2999.6427 3000.3340 3063.4326 3065.1198 3092.5065 3094.6599 3111.4502 3114.8676
redmass: 2.3574 5.6152 5.1732 1.8251 2.9882 5.3972 8.5931 4.9396 6.9121 8.5960 2.8494 1.8382 1.4474 3.9775 3.9164 12.7375 4.3072 11.2934 4.9739 7.4860 11.0073 14.8313 6.5848 5.7895 11.0152 1.0958 1.0900 4.7636 4.2846 11.9608 11.5698 2.4297 2.7086 15.1080 2.2442 2.2698 1.4047 1.4324 1.1438 1.1535 1.2497 1.2526 1.2429 1.2423 1.0393 1.0401 1.0536 1.0528 1.0799 1.0808 1.0371 1.0439 1.0488 1.0554 1.1089 1.1084 1.0980 1.0980 1.1027 1.1026
irintensity: 0.0231 0.5543 1.7221 3.0141 2.4164 0.2233 1.2976 5.6298 6.1408 7.8720 2.5408 0.2500 0.3667 4.7710 14.4042 1.4289 6.5246 0.7557 11.1701 32.3383 78.6400 25.0694 57.9289 70.8097 139.9504 8.0143 5.7378 193.4975 170.3708 145.3800 122.1207 194.8468 76.1459 117.3767 14.5306 10.0373 5.6046 5.2983 0.3144 0.1559 8.8542 4.2156 25.9276 27.2348 13.4328 13.5586 3.5278 8.8701 9.6085 9.8494 15.5822 17.9357 31.4394 22.0757 10.4327 7.0095 26.1189 23.7571 33.8013 30.5435
temp: 298.150 k
press: 1.00000 atm
elementType: 35 15 9 9 8 8 8 6 6 6 6 6 1 1 1 1 1 1 1 1 1 1
symmnumber: 1
zpe: 401559.5 jmol-1
zpe.correction: 0.152946 hartree
zpe.thermalcorrener: 0.168399 hartree
zpe.thermalcorrenthalpy: 0.169344 hartree
zpe.thermalcorrgfe: 0.106292 hartree
zpe.sumelectzpe: -975.550487 hartree
zpe.sumelectthermal: -975.535033 hartree
zpe.sumelectthermalent: -975.534089 hartree
zpe.sumelectthermalfe: -975.597140 hartree
dipole: -2.6293 0.1697 -2.9617
dipole: 3.9641
quadrupole: -82.5780 -74.6923 -95.7565
quadrupole: -0.4433 2.8050 -0.1026
quadrupole: 1.7642 9.6500 -11.4142 -0.4433 2.8050 -0.1026
hfenergy: -975.7034325 hartree
pointgroup: C01 [X(C5H10Br1F2O3P1)]
dipole: -0.2607877 -1.4185807 -0.5932724 debye
dipolederiv: -0.0378281 -0.0316676 0.0034165 -0.0258579 -0.1391627 0.1465773 -0.0067211 0.2045181 -0.764581 2.1420626 0.0528828 -0.1330867 -0.3330763 1.797802 -0.334371 0.0383771 0.3361763 1.1929853 -0.3514776 0.1638641 0.1851666 0.2325956 -0.810556 -0.2577527 0.1420176 -0.2046545 -0.4857428 -0.8645295 -0.0974365 -0.2714216 -0.1591187 -0.3741327 0.0175594 -0.1780425 0.0235153 -0.4031617 -1.2054914 0.5581527 -0.0203312 0.5753432 -0.9863236 0.0935046 0.012152 -0.0488057 -0.4591292 -1.5078925 -0.4096209 0.0175037 -0.4560095 -0.7372269 0.0247829 -0.1164263 -0.0451724 -0.4569687 -0.6879097 -0.0249957 0.0392651 0.0375843 -0.6859298 0.1052401 -0.0098641 -0.0483351 -0.6767657 1.0091888 -0.0410533 0.1246191 -0.0228996 0.9954813 0.2304212 0.0591078 -0.008931 1.4828157 0.8376881 -0.4620656 0.0269337 -0.2840265 0.5105713 -0.0470525 0.2699536 -0.2645906 0.2345463 0.8930332 0.2331566 -0.0063726 0.55579 0.5040147 0.0569946 -0.2405349 -0.0334842 0.2573666 -0.0578695 0.1373007 0.0185957 0.0916873 -0.1081705 -0.0627245 -0.0212205 -0.016175 0.0300927 -0.1792102 -0.0162993 -0.0708862 -0.0778274 0.019134 0.0067353 -0.0335159 0.0150112 0.0266089 -0.11538 -0.0215714 -0.0107371 -0.0887661 -0.0730534 -0.0125904 -0.0250666 0.0370494 0.0678034 0.0135114 0.0381031 0.0639866 0.0242708 0.0493952 0.0002808 -0.0283338 0.0591554 -0.0891843 -0.043469 0.0686287 0.014287 -0.0213516 -0.1339154 -0.0178144 0.0408878 -0.0332148 0.061288 0.0062097 -0.0293014 -0.0245006 -0.0639415 0.0445515 -0.0272688 0.0587299 0.0291232 -0.1135024 -0.075016 0.1098473 -0.0766191 0.1108913 0.0254362 0.0153705 -0.0786345 0.0180246 0.0663767 -0.0164486 -0.1544216 0.0149268 -0.1003898 -0.0024521 -0.0019998 0.0383409 -0.005601 0.0877324 0.1179864 -0.0254729 0.0239184 -0.0173584 0.078756 0.0641067 0.0540807 0.0093282 -0.1091986 -0.0690414 -0.1128973 0.017232 -0.1217101 -0.001099 0.0444315 0.0179166 0.0485611 0.0930216 0.091722 0.0533632 0.0031629 0.1082486 -0.0798153 -0.0443156 -0.0001413 -0.0635988 0.0740703 0.1001613 0.0115042 0.0609408 0.0359221 0.1066951 -0.0001151 0.0069375 -0.0078999 -0.1164734 unknown
polarizability: 109.0330327|-3.8564159|99.5525266|1.8424293|-8.9845398|113.7818179 unknown
InChI: InChI=1S/C5H10BrF2O3P/c1-3-10-12(9,11-4-2)5(6,7)8/h3-4H2,1-2H3
charge 0 multiplicity 1
22 atoms
Br 0.420679 1.908802 -2.249243
P  -0.078857 0.092938 0.486478
F  -0.118978 2.847853 0.330568
F  1.929528 1.886529 0.104344
O  0.836783 -1.112109 -0.347496
O  -1.588903 0.03628 -0.310249
O  -0.040584 0.011193 2.074966
C  0.561331 1.76879 -0.271569
C  2.059127 -1.67661 0.320042
C  -2.595003 -0.996975 0.105591
C  2.397808 -2.957071 -0.434801
C  -3.874324 -0.658859 -0.650296
H  2.869101 -0.927764 0.2440
H  1.832682 -1.861882 1.386102
H  -2.201662 -1.993261 -0.169286
H  -2.730262 -0.940123 1.201761
H  3.314719 -3.406667 -0.010518
H  1.577925 -3.690422 -0.35328
H  2.575153 -2.745046 -1.502613
H  -4.660156 -1.39515 -0.39933
H  -4.234661 0.346628 -0.376233
H  -3.702144 -0.686774 -1.739239
