program: Gaussian 09
title: 000144099
version: EM64L-G09RevD.01
frameworkgroup: C1[X(C9H4ClF15O)]
method: RPBEPBE
basis: SDD
operation: Freq
keyword: #p
keyword: freq=noraman
keyword: PBEPBE/SDD
title: #p freq=noraman PBEPBE/SDD
converged: YES YES NO NO
title: Mulliken charges:
elementType: Cl F F F F F F F F F F F F F F F O C C C C C C C C C H H H H
charge: 0.049573 -0.134305 -0.132490 -0.139174 -0.130627 -0.113243 -0.133707 -0.141967 -0.133644 -0.136861 -0.125210 -0.152818 -0.157251 -0.158153 -0.166631 -0.137859 -0.233209 0.242979 0.238357 0.250505 0.279308 0.256213 -0.328844 0.078103 0.430870 -0.290985 0.281219 0.293627 0.246758 0.299469
chargesum: 0.00000
title: Mulliken charges with hydrogens summed into heavy atoms:
elementType: Cl F F F F F F F F F F F F F F F O C C C C C C C C C
charge: 0.049573 -0.134305 -0.132490 -0.139174 -0.130627 -0.113243 -0.133707 -0.141967 -0.133644 -0.136861 -0.125210 -0.152818 -0.157251 -0.158153 -0.166631 -0.137859 -0.233209 0.242979 0.238357 0.250505 0.279308 0.256213 0.246001 0.324861 0.430870 0.008483
polarizability: 1.37367584e+02 5.12982641e+00 1.13041867e+02 3.61439703e-01 3.52207495e-01 9.98989616e+01
1716.lowfreq: -7.6788 -1.7825 -0.0016 -0.0006 -0.0005 4.4145 6.9651 14.5376 24.6281
frequency: 3.1311 14.4979 24.5604 35.5619 48.9659 54.3344 55.6766 70.1648 89.2525 104.7548 114.6245 126.1751 132.7539 150.3324 171.5680 183.6438 199.1637 214.1743 225.2688 242.0003 249.2867 254.5647 262.9757 277.2878 282.9335 288.5848 296.4293 302.3725 308.2010 320.9655 334.9873 347.0921 373.1150 407.0188 417.7758 424.7058 441.9341 465.5233 491.3583 508.8066 515.6230 557.5504 566.7632 575.4538 585.3955 638.7725 718.9086 738.6735 751.3225 780.5309 834.3852 883.2961 892.6509 928.2646 936.0868 963.9521 982.4097 996.7338 1000.1219 1010.6404 1022.2647 1034.9545 1043.0736 1052.8142 1068.1255 1113.5631 1122.3091 1140.8241 1146.7257 1157.6134 1161.7602 1178.4023 1212.6313 1234.4055 1270.1879 1299.7699 1316.4652 1337.7074 1395.2151 1445.2336 3045.1683 3101.3558 3119.9153 3122.3070
redmass: 16.4481 14.3039 14.3150 12.3914 13.9496 16.5334 13.1190 12.4051 15.6288 16.6053 15.1418 6.3894 16.5221 16.8914 17.5430 13.6625 13.8872 17.0103 15.8921 17.0861 17.1461 16.1517 15.1334 18.0014 17.9763 17.7495 17.9113 13.9142 15.7586 5.2262 12.4392 12.8381 8.2887 10.6671 13.9882 10.4128 14.0418 10.6792 12.0076 15.3487 9.4126 15.2914 15.6405 14.9820 16.5740 9.1963 7.2370 7.1296 6.6258 7.1625 10.9795 3.3749 7.5337 9.0567 10.4948 9.6102 11.5239 7.7868 8.6671 8.3880 12.0643 6.8520 10.3781 9.9570 4.4027 5.6745 9.4461 10.7643 8.8760 8.3769 10.0944 7.4005 2.8615 1.2455 1.1964 1.1808 1.5368 1.3237 1.3634 1.0749 1.0568 1.0881 1.1088 1.0884
irintensity: 0.7046 0.0493 0.7608 0.8863 1.7257 0.1673 0.2694 1.7400 0.5692 1.2978 0.7837 4.9320 1.7580 1.9376 0.4375 0.3075 4.7944 15.8442 2.5647 1.4961 0.7044 0.1163 3.7991 0.2084 2.5368 1.7719 0.1933 2.6158 0.5206 1.1913 3.6622 5.5844 1.6602 6.9348 5.1718 9.6369 0.9442 3.6419 15.1600 5.9842 8.2133 7.8204 9.1035 4.4475 3.7235 66.7383 88.7738 75.4122 8.7620 66.2543 188.1994 36.3883 76.8740 29.5028 169.3567 98.8535 44.0437 8.5947 32.1171 20.3300 153.4401 130.5700 26.2202 285.9227 410.2429 120.1892 83.0944 31.5623 11.7400 15.7935 17.7150 42.1800 71.7438 3.8543 32.8836 3.6981 26.3201 6.8610 19.4049 12.0732 10.2370 9.0288 0.2650 4.0700
temp: 298.150 k
press: 1.00000 atm
elementType: 17 9 9 9 9 9 9 9 9 9 9 9 9 9 9 9 8 6 6 6 6 6 6 6 6 6 1 1 1 1
symmnumber: 1
zpe: 366756.2 jmol-1
zpe.correction: 0.139690 hartree
zpe.thermalcorrener: 0.166547 hartree
zpe.thermalcorrenthalpy: 0.167491 hartree
zpe.thermalcorrgfe: 0.077438 hartree
zpe.sumelectzpe: -2376.181293 hartree
zpe.sumelectthermal: -2376.154436 hartree
zpe.sumelectthermalent: -2376.153491 hartree
zpe.sumelectthermalfe: -2376.243545 hartree
dipole: -0.2147 2.3255 0.0387
dipole: 2.3357
quadrupole: -168.9057 -158.4091 -154.9137
quadrupole: -2.7269 -4.4872 2.7479
quadrupole: -8.1629 2.3337 5.8291 -2.7269 -4.4872 2.7479
hfenergy: -2376.3209827 hartree
pointgroup: C01 [X(C9H4Cl1F15O1)]
dipole: -0.0947861 -0.8914446 -0.2020014 debye
polarizability: 137.2350362|-5.4447852|112.5428636|-0.4454702|2.813839|100.5305126 unknown
InChI: InChI=1S/C9H4ClF15O/c10-2(11)6(18,19)26-1-4(14,15)7(20,21)9(24,25)8(22,23)5(16,17)3(12)13/h2-3H,1H2
charge 0 multiplicity 1
30 atoms
Cl 6.109021 -0.89154 0.421107
F  -0.592331 0.044647 -2.27393
F  -2.563777 -1.007543 -1.762074
F  -1.539905 -1.987486 0.570755
F  -0.363905 -2.480758 -1.328845
F  -2.565141 1.718617 -1.558671
F  -0.825652 1.698679 -0.084464
F  1.174108 -2.325623 0.87172
F  0.453837 -0.232362 1.404606
F  -2.290594 0.382994 1.807478
F  -3.389367 2.193756 0.950328
F  -5.070989 0.127278 1.590732
F  -4.952523 0.421061 -0.680949
F  4.164922 0.8337 -1.394719
F  3.110113 1.876845 0.319464
F  5.83406 1.758287 0.735862
O  3.027411 -0.452591 0.186188
C  -1.434147 -0.3542 -1.202187
C  -0.647195 -1.451647 -0.389879
C  -1.95927 0.969518 -0.526029
C  0.716934 -1.099526 0.312678
C  -2.98318 0.872557 0.668558
C  1.787932 -0.514628 -0.613774
C  -4.237885 -0.028922 0.457977
C  3.823341 0.667943 -0.013963
C  5.07141 0.569319 0.886238
H  1.49259 0.489241 -0.960822
H  1.954973 -1.184884 -1.472302
H  -3.989679 -1.096595 0.342662
H  4.77989 0.451563 1.939653
