program: Gaussian 09
title: 000144077
version: EM64L-G09RevD.01
frameworkgroup: C1[X(C10H14O)]
method: RPBEPBE
basis: SDD
operation: Freq
keyword: #pfreq=noraman
keyword: PBEPBE/SDD
title: #p freq=noraman PBEPBE/SDD
converged: NO YES NO NO
title: Mulliken charges:
elementType: O C C C C C C C C C C H H H H H H H H H H H H H H
charge: -0.287458 -0.174663 -0.188595 -0.109510 -0.469480 -0.444441 -0.217874 -0.190619 -0.223919 -0.245258 -0.513002 0.214839 0.240295 0.238035 0.239926 0.216677 0.240573 0.212778 0.219161 0.210784 0.200594 0.196996 0.202369 0.234242 0.197549
chargesum: 0.00000
title: Mulliken charges with hydrogens summed into heavy atoms:
elementType: O C C C C C C C C C C
charge: -0.287458 0.040176 0.051701 0.128525 -0.012877 0.008910 0.001287 0.020166 -0.023326 -0.048262 0.121158
polarizability: 1.14762454e+02 -2.44154376e+00 1.07720849e+02 -8.70935496e+00 -7.29513142e+00 8.74525788e+01
1716.lowfreq: -18.9410 -7.4318 0.0004 0.0005 0.0005 17.6701 90.1734 100.4938 131.6670
frequency: 90.1617 100.4797 131.6572 183.0695 218.3349 239.6733 271.9169 350.7384 381.2542 425.6169 440.7916 549.2496 600.2714 650.4217 700.6833 766.1425 791.5343 807.2199 828.8750 841.2773 871.6196 894.5381 905.1944 945.7623 967.2285 969.7434 983.3306 1023.5437 1041.0568 1049.1058 1072.3868 1091.9138 1117.4218 1142.0246 1152.4449 1171.7660 1193.2299 1232.5274 1243.9494 1249.2811 1276.0129 1280.0712 1303.8706 1309.0465 1314.9060 1367.6495 1377.8293 1416.4212 1437.5711 1459.3237 1461.0434 1476.1568 1476.9348 1622.6518 1640.6060 2926.6600 2978.0451 2999.4889 3004.4746 3014.1235 3021.9262 3032.2323 3062.6525 3079.4066 3086.6540 3092.6301 3094.8711 3110.4597 3126.3746
redmass: 2.6202 2.3032 2.1651 1.5441 3.1402 2.2010 2.8336 4.6031 3.6690 4.3019 2.3674 3.1757 4.7032 2.2958 1.5574 1.7131 3.1419 2.3278 2.5087 3.7630 3.0413 2.9975 2.5500 3.0334 1.9927 1.4758 1.3057 2.7414 2.4830 3.7921 1.5906 1.9993 1.2786 1.3628 1.2168 1.6523 1.2790 1.1147 1.1585 1.2034 1.3354 1.3511 1.2999 1.3440 1.4453 1.5906 1.3529 1.6060 1.1337 1.0745 1.0682 1.0654 1.0765 8.7964 5.5432 1.0340 1.0859 1.1019 1.0595 1.0694 1.0798 1.0822 1.1046 1.0824 1.1048 1.0859 1.0972 1.0950 1.0978
irintensity: 1.5049 1.3015 2.6030 0.8022 0.8729 3.7541 3.1251 1.1483 2.2712 0.8991 9.7248 2.3004 3.8985 6.5126 85.1946 0.4281 4.7348 2.5425 9.0811 10.7290 6.8480 3.9783 7.9516 2.8627 2.0945 0.0101 0.1535 18.6136 26.3981 78.9903 0.8321 6.3462 0.4876 9.8388 0.6750 2.3172 11.5314 2.9636 4.5612 1.1947 0.4690 4.1165 1.1690 1.7225 4.3401 16.3441 2.5474 0.1523 2.4566 7.8750 11.0930 15.4881 8.1036 8.7415 0.3317 77.4927 48.5956 63.9431 17.2114 49.2113 51.0900 15.2127 5.2205 1.1119 47.6432 8.9616 32.8980 62.6584 51.4299
temp: 298.150 k
press: 1.00000 atm
elementType: 8 6 6 6 6 6 6 6 6 6 6 1 1 1 1 1 1 1 1 1 1 1 1 1 1
symmnumber: 1
zpe: 565460.0 jmol-1
zpe.correction: 0.215372 hartree
zpe.thermalcorrener: 0.225415 hartree
zpe.thermalcorrenthalpy: 0.226359 hartree
zpe.thermalcorrgfe: 0.180317 hartree
zpe.sumelectzpe: -463.784291 hartree
zpe.sumelectthermal: -463.774249 hartree
zpe.sumelectthermalent: -463.773305 hartree
zpe.sumelectthermalfe: -463.819347 hartree
dipole: -0.1044 -1.0701 0.0590
dipole: 1.0768
quadrupole: -63.2463 -63.6798 -67.1950
quadrupole: 3.9270 -1.0495 -0.9467
quadrupole: 1.4607 1.0272 -2.4880 3.9270 -1.0495 -0.9467
hfenergy: -463.9996636 hartree
pointgroup: C01 [X(C10H14O1)]
dipole: -0.0380544 -0.4202191 -0.0379282 debye
dipolederiv: -1.0713163 -0.1700042 -0.2031381 -0.1098048 -0.4141621 -0.0178765 -0.177443 -0.0280765 -0.4518732 0.0272013 0.1225284 -0.0464911 0.2458188 -0.0620151 -0.0083098 -0.0670274 0.0385237 -0.0418559 -0.071275 -0.0645586 0.0614331 -0.0344313 -0.0008776 -0.0107822 0.1037241 -0.1272665 0.077155 0.7295554 0.0430898 0.170598 -0.1585059 0.1610888 -0.0595795 0.1658362 -0.0294942 0.3504073 0.0522609 0.0095877 0.035237 0.0532787 -0.0119422 -0.0142644 -0.0544887 -0.0272036 0.1126608 0.105385 0.0516771 -0.006109 -0.0097741 0.0924253 0.0192691 0.033552 0.0698525 0.0078257 0.1218253 -0.1537497 -0.1436448 -0.1886329 0.0233122 0.0248525 -0.1814524 -0.0239306 -0.1849756 0.2064361 -0.1026509 -0.1458383 -0.033596 0.0265125 -0.0357 -0.1084128 0.0402464 -0.2315004 -0.0812278 -0.1470995 -0.0088677 -0.0930519 0.1898258 -0.0477229 -0.0243185 -0.0160955 -0.1690594 0.095393 0.1901577 -0.0864453 0.1069679 -0.0434522 -0.0860481 -0.0709222 -0.1186232 -0.1239572 0.4764151 0.1418017 0.0801131 0.3194358 0.3810795 0.0853485 0.1495615 0.0478534 0.3869135 -0.0776474 -0.1069865 0.0476507 -0.1045219 -0.0580572 0.0165183 0.0462907 0.0277479 0.0552384 0.032476 0.0675786 -0.0297929 0.0445995 -0.0265475 0.1061144 -0.0398361 0.0985647 -0.015524 -0.0329572 0.0035243 -0.0070661 0.0373293 -0.0182915 -0.0896201 0.0176524 -0.0741697 -0.1522771 -0.0953002 0.0270687 -0.1172385 0.0097775 0.0220354 0.024719 -0.0591953 0.0054339 0.0397532 -0.0074547 -0.0166452 0.1518405 -0.0118071 0.0571896 0.0214073 0.1107615 0.0152922 -0.1125068 -0.1053588 0.1427027 0.0611418 0.0710752 0.0299182 0.0063452 0.0602015 -0.0304079 0.050838 -0.0163566 -0.1464645 -0.0786073 -0.0765547 -0.0499924 -0.0733234 -0.0715485 -0.0340675 0.0275973 0.046077 -0.0028571 0.0444992 0.0480002 -0.1379105 0.0578073 0.0414296 0.058233 0.1354464 -0.0241723 -0.0598638 0.04399 -0.0962602 -0.08338 0.067261 0.0421523 0.0600211 0.1226679 -0.0668094 0.1320134 0.0556887 0.1086153 -0.0445542 0.0005068 0.0612511 -0.0010523 0.1303265 -0.1630807 -0.0305261 0.090635 -0.0115751 0.0436748 0.0264745 0.0753124 0.0279434 0.1290139 0.0322319 0.0164594 0.0917936 -0.0871759 0.0045984 -0.1034838 -0.0300475 -0.1066881 -0.1858928 -0.1700512 0.0428713 -0.0315732 0.0834863 0.0609185 -0.001136 -0.0204801 -0.0098467 0.1009992 0.0577504 0.0103452 -0.0298084 -0.1126927 -0.1413965 0.0912228 -0.0025527 0.1372101 -0.0574209 unknown
polarizability: 116.0797071|-0.8584369|109.3178783|-6.3634067|-4.3670026|84.538297 unknown
InChI: InChI=1S/C10H14O/c1-11-10-8-4-2-3-5-9(10)7-6-8/h2-5,8-10H,6-7H2,1H3
charge 0 multiplicity 1
25 atoms
O  -2.18479 0.356183 -0.496162
C  -0.370128 -0.902423 0.718086
C  0.030743 1.274322 -0.328162
C  -0.760826 -0.031637 -0.520548
C  -0.081391 0.150008 1.857651
C  -0.187768 1.561439 1.189729
C  0.83316 -1.778179 0.404361
C  1.510442 1.152801 -0.657673
C  1.984252 -1.335363 -0.191878
C  2.3135 0.042163 -0.607876
C  -3.08044 -0.712573 -0.926308
H  -1.217585 -1.552609 1.001687
H  -0.415413 2.068543 -0.954225
H  -0.534919 -0.544061 -1.478833
H  0.931807 -0.01095 2.264543
H  -0.796524 0.049024 2.692949
H  -1.196913 1.98676 1.332238
H  0.553779 2.2702 1.600571
H  0.767733 -2.840523 0.675929
H  1.989882 2.099819 -0.945507
H  2.786349 -2.070276 -0.349387
H  3.364429 0.188169 -0.897403
H  -2.823567 -1.069503 -1.946739
H  -4.092896 -0.277597 -0.935926
H  -3.067917 -1.581435 -0.234617
