program: Gaussian 09
title: 000144069
version: EM64L-G09RevD.01
frameworkgroup: C1[X(C3H7N)]
method: RPBEPBE
basis: SDD
operation: Freq
keyword: #p
keyword: freq=noraman
keyword: PBEPBE/SDD
title: #p freq=noraman PBEPBE/SDD
converged: YES YES NO NO
title: Mulliken charges:
elementType: N C C C H H H H H H H
charge: -0.034819 -0.693893 -0.146761 -0.653996 0.220780 0.221002 0.247663 0.181210 0.186079 0.236331 0.236403
chargesum: 0.00000
title: Mulliken charges with hydrogens summed into heavy atoms:
elementType: N C C C
charge: -0.034819 -0.004447 0.034449 0.004817
polarizability: 5.72980454e+01 4.56599316e+00 3.67036063e+01 3.05583970e-03 -2.49910167e-03 2.85541004e+01
1716.lowfreq: -22.0077 0.0004 0.0007 0.0008 13.3198 14.0054 163.2769 229.0102 259.1297
frequency: 163.2615 229.0092 259.1282 296.3947 519.3099 857.9066 861.0800 1025.7267 1067.8798 1085.4093 1106.3013 1155.9336 1354.0310 1385.8442 1412.0436 1453.7143 1454.6810 1461.1743 1470.7220 1668.6839 2893.5948 2906.2664 2975.0383 3030.5537 3050.8607 3061.6238 3114.9333
redmass: 1.0664 1.4532 2.0904 2.4711 2.8320 2.1731 1.1304 3.4124 1.5804 1.4319 1.4155 2.0435 1.2616 1.2999 1.1670 1.0446 1.0594 1.0483 1.0592 6.5458 1.0833 1.0477 1.0380 1.0844 1.0965 1.0991 1.0988
irintensity: 1.0178 11.8734 4.2981 8.5857 1.0030 6.6821 14.8189 14.2070 0.0298 3.5222 4.5430 2.1749 0.1889 28.6514 3.1119 13.1265 14.4967 16.1393 28.1766 51.1044 63.6828 139.5241 18.5787 39.0025 24.8422 26.3480 18.9956
temp: 298.150 k
press: 1.00000 atm
elementType: 7 6 6 6 1 1 1 1 1 1 1
symmnumber: 1
zpe: 247155.1 jmol-1
zpe.correction: 0.094136 hartree
zpe.thermalcorrener: 0.099523 hartree
zpe.thermalcorrenthalpy: 0.100467 hartree
zpe.thermalcorrgfe: 0.066818 hartree
zpe.sumelectzpe: -172.905918 hartree
zpe.sumelectthermal: -172.900532 hartree
zpe.sumelectthermalent: -172.899587 hartree
zpe.sumelectthermalfe: -172.933236 hartree
dipole: 0.1356 1.7316 0.0037
dipole: 1.7369
quadrupole: -21.4781 -27.0518 -25.9139
quadrupole: -0.2291 0.0018 0.0020
quadrupole: 3.3365 -2.2372 -1.0993 -0.2291 0.0018 0.0020
hfenergy: -173.0000542 hartree
pointgroup: C01 [X(C3H7N1)]
dipole: -0.064507 0.6488297 0.2045626 debye
dipolederiv: -0.4663203 -0.0396719 -0.0088886 0.2322391 -0.445616 -0.0397554 0.0772501 -0.0301079 -0.3571487 -0.3314161 -0.0475267 -0.0010277 -0.02094 -0.0005803 -0.0232695 0.0048846 -0.0218296 0.0690781 0.6159849 -0.0235058 -0.0318391 0.0076224 0.4680767 0.1759823 -0.0207972 0.1764012 -0.0394491 0.207039 0.0298434 0.008735 0.0289023 0.2914163 0.0349412 0.0087181 0.0347905 0.1893294 0.0090351 -0.0005361 0.0826474 -0.0308426 0.1162459 -0.0402033 0.1194948 -0.0224112 -0.0914137 -0.0041881 0.0515907 -0.0699926 0.048 0.0232784 0.1129402 -0.117089 0.0941803 0.0147824 0.0988757 0.0230754 0.0078223 -0.0583972 -0.090953 -0.0622358 -0.0170638 -0.0653668 0.0984887 -0.0358572 -0.0741794 -0.015941 -0.0203266 -0.2584058 -0.1322165 0.000437 -0.1301144 0.125543 -0.0538968 0.0225247 0.0123877 -0.1633242 -0.2293659 -0.0967774 -0.0463422 -0.1032236 0.0640949 -0.0117031 0.002966 0.0832389 -0.0590635 0.1060459 -0.0354779 0.1357418 -0.0153052 -0.0877507 -0.027553 0.0554198 -0.0671424 0.0361302 0.0198577 0.106072 -0.1452342 0.0829867 0.0144456 unknown
polarizability: 57.4094749|-3.7394033|35.7608671|-2.1903219|2.3982227|29.3854101 unknown
InChI: InChI=1S/C3H7N/c1-3-4-2/h3H,1-2H3
charge 0 multiplicity 1
11 atoms
N  0.516413 -0.375135 -0.189988
C  -1.916651 -0.072382 -0.009029
C  -0.487909 0.402388 0.090439
C  1.884978 0.164937 -0.068729
H  -2.429732 0.023177 0.967526
H  -2.484935 0.545936 -0.730815
H  -1.946458 -1.124801 -0.332525
H  -0.348661 1.46195 0.416238
H  1.940492 1.227099 0.265348
H  2.390665 0.075139 -1.048001
H  2.452997 -0.460708 0.644536
