program: Gaussian 09
title: 000144048
version: EM64L-G09RevD.01
frameworkgroup: C1[X(C13H14O)]
method: RPBEPBE
basis: SDD
operation: Freq
keyword: #pfreq=noraman
keyword: PBEPBE/SDD
title: #p freq=noraman PBEPBE/SDD
converged: YES YES NO NO
title: Mulliken charges:
elementType: O C C C C C C C C C C C C C H H H H H H H H H H H H H H
charge: -0.436584 -0.207173 -0.214058 -0.331870 -0.172623 -0.509474 -0.282625 0.501197 -0.214142 -0.439050 -0.421209 -0.221787 -0.250018 -0.241711 0.257918 0.255690 0.235493 0.247263 0.219788 0.224300 0.241212 0.231326 0.354840 0.233371 0.254442 0.227100 0.227344 0.231039
chargesum: 0.00000
title: Mulliken charges with hydrogens summed into heavy atoms:
elementType: O C C C C C C C C C C C C C
charge: -0.081744 0.050745 0.041631 -0.096377 0.074640 -0.065386 -0.041414 0.501197 0.017185 -0.205680 -0.166766 0.005314 -0.022674 -0.010672
polarizability: 1.89969712e+02 3.84518542e+00 1.04435118e+02 -3.09900706e+00 1.46732158e+01 1.08422086e+02
1716.lowfreq: -14.8752 -3.8057 -0.0006 -0.0005 0.0003 7.3654 37.2978 68.1677 82.7580
frequency: 37.2340 68.0868 82.7531 133.7369 217.1141 239.0773 262.5822 299.8910 335.9936 358.7668 405.0668 420.0860 446.3621 537.4350 598.3754 616.6054 693.1886 700.3319 709.8521 748.0511 755.8106 762.4694 808.0629 852.9195 855.9486 871.7972 909.6879 923.2550 939.0634 946.2475 970.9768 976.3964 989.6878 996.2525 1014.7127 1019.2320 1025.5731 1030.7881 1073.4748 1085.2682 1101.0836 1122.1050 1136.6054 1172.6658 1180.3523 1190.9282 1203.3801 1210.3893 1211.3427 1213.5324 1263.7689 1280.3255 1300.4037 1304.0273 1338.0953 1343.3327 1377.9627 1382.8435 1441.1971 1460.1943 1483.9813 1587.5535 1611.4804 1617.9290 2968.8850 3012.0612 3013.5081 3028.7851 3049.0137 3063.1142 3117.2117 3120.3225 3130.5981 3134.5761 3144.7577 3163.5855 3164.6246 3501.9364
redmass: 4.2448 3.4357 4.5700 4.1709 3.8811 4.0966 3.5254 3.2098 1.7725 1.7836 2.7774 2.5584 3.5874 3.5852 3.9454 6.0880 2.5314 2.1352 1.6894 3.8562 2.8484 2.3894 3.3141 1.4460 1.6996 2.1819 2.1908 1.7233 2.3594 1.3411 3.1911 1.3950 6.0041 1.3166 2.2794 2.2183 2.3876 2.0709 2.0703 1.7082 1.1135 1.2188 1.4358 1.0600 1.8617 1.1476 1.3704 1.2537 1.7350 1.3817 1.4501 1.6540 1.5748 1.7949 1.6912 1.4277 1.4865 2.8864 2.1699 1.0944 2.2894 5.8349 6.0641 6.1827 1.0598 1.0874 1.1000 1.0865 1.0893 1.0879 1.0859 1.0871 1.0857 1.0911 1.0958 1.1015 1.1062 1.0656
irintensity: 1.0399 0.3050 0.2655 1.0569 2.2635 5.3096 0.2437 0.7994 28.3351 101.1713 2.3712 1.6711 5.0228 10.4739 4.7482 0.3718 10.2940 45.5682 54.8716 7.2316 46.6431 5.3924 10.5841 1.4775 2.7712 5.1194 2.8083 8.6500 5.8281 0.1318 14.9631 0.3669 0.1443 0.1490 29.9868 7.2850 2.0537 12.9820 64.4312 36.9854 2.6042 21.7147 1.0894 0.4313 2.9566 0.3324 4.6357 1.3296 2.6708 17.5641 0.2398 1.7626 7.6564 5.2866 5.5163 2.5415 20.0858 8.6286 8.8183 10.3806 26.5078 1.5875 13.0739 3.7927 53.6900 36.4784 14.1614 18.8055 9.1228 53.5032 8.9179 3.6797 5.0885 9.5709 40.2866 31.0053 30.9567 20.0124
temp: 298.150 k
press: 1.00000 atm
elementType: 8 6 6 6 6 6 6 6 6 6 6 6 6 6 1 1 1 1 1 1 1 1 1 1 1 1 1 1
symmnumber: 1
zpe: 609298.0 jmol-1
zpe.correction: 0.232069 hartree
zpe.thermalcorrener: 0.243742 hartree
zpe.thermalcorrenthalpy: 0.244687 hartree
zpe.thermalcorrgfe: 0.193786 hartree
zpe.sumelectzpe: -577.944536 hartree
zpe.sumelectthermal: -577.932863 hartree
zpe.sumelectthermalent: -577.931918 hartree
zpe.sumelectthermalfe: -577.982819 hartree
dipole: -0.4144 -1.3267 1.1996
dipole: 1.8360
quadrupole: -72.9138 -87.8978 -81.8399
quadrupole: -1.2032 -0.5275 8.3675
quadrupole: 7.9700 -7.0140 -0.9561 -1.2032 -0.5275 8.3675
hfenergy: -578.176605 hartree
pointgroup: C01 [X(C13H14O1)]
dipole: 0.1623194 0.6576129 0.2509377 debye
polarizability: 189.9564145|4.8949758|95.0901716|1.2890431|-9.5102068|117.7803293 unknown
InChI: InChI=1S/C13H14O/c14-13-11-8-4-7-10(11)12(13)9-5-2-1-3-6-9/h1-7,10-14H,8H2
charge 0 multiplicity 1
28 atoms
O  -0.346181 -2.357353 -0.214461
C  -1.921851 -0.522597 0.745887
C  -1.402168 0.894324 0.27586
C  -0.370863 0.218231 -0.716213
C  -1.128793 -1.163413 -0.450123
C  -3.467663 -0.523107 0.621323
C  -2.632902 1.507585 -0.363242
C  1.083058 0.22752 -0.29271
C  -3.746036 0.744876 -0.182014
C  2.109199 0.358295 -1.265449
C  1.469705 0.060919 1.067711
C  3.472544 0.333611 -0.898563
C  2.833633 0.034544 1.438606
C  3.841494 0.170383 0.457038
H  -1.55172 -0.871371 1.724943
H  -0.932991 1.557742 1.02544
H  -0.455956 0.559282 -1.762669
H  -1.794887 -1.424386 -1.289388
H  -3.975929 -0.487299 1.605969
H  -3.834713 -1.435903 0.109969
H  -2.606415 2.465355 -0.894522
H  -4.745938 1.000175 -0.550918
H  0.455049 -2.123636 0.324663
H  1.831402 0.481765 -2.319315
H  0.704086 -0.022153 1.849069
H  4.245955 0.441672 -1.667456
H  3.108312 -0.089426 2.49238
H  4.898668 0.151866 0.743885
