program: Gaussian 09
title: 000144047
version: EM64L-G09RevD.01
frameworkgroup: C1[X(C10H15N)]
method: RPBEPBE
basis: SDD
operation: Freq
keyword: #pfreq=noraman
keyword: PBEPBE/SDD
title: #p freq=noraman PBEPBE/SDD
converged: YES YES NO NO
title: Mulliken charges:
elementType: N C C C C C C C C C C H H H H H H H H H H H H H H H
charge: -0.571974 0.489935 -0.539969 0.488834 -0.532584 -0.419424 -0.404551 -0.389157 -0.404871 -0.411102 -0.672765 0.195677 0.229100 0.207772 0.207110 0.231752 0.226871 0.198952 0.220616 0.227556 0.227106 0.221771 0.214443 0.221947 0.261266 0.275689
chargesum: 0.00000
title: Mulliken charges with hydrogens summed into heavy atoms:
elementType: N C C C C C C C C C C
charge: -0.035019 0.489935 -0.115192 0.488834 -0.117702 -0.187672 -0.177680 0.030411 -0.177315 -0.183996 -0.014604
polarizability: 1.60118888e+02 4.69097959e-01 1.06088153e+02 -3.94259838e+00 3.33894211e+00 7.57580529e+01
1716.lowfreq: -10.8295 -6.1853 0.0004 0.0005 0.0006 3.8614 28.0872 40.7725 59.5871
frequency: 27.0718 38.6534 59.3380 96.2551 143.4977 206.9093 219.0390 240.4008 299.6104 327.1085 379.1417 405.3758 420.6942 485.6775 580.0314 589.2385 638.7613 714.9890 758.5207 783.4627 794.3282 814.3618 844.9298 849.9541 938.3519 957.9051 968.4021 970.6055 1012.3764 1015.6433 1050.0081 1063.1257 1093.4393 1111.2809 1132.3939 1189.1924 1214.4158 1217.5554 1232.1463 1242.3813 1285.0789 1306.8881 1313.0951 1318.2467 1378.7956 1381.0221 1387.9389 1409.3827 1471.3253 1472.8432 1473.5640 1488.7812 1491.6245 1507.9554 1581.9118 1623.8773 1638.2696 2881.9141 2976.8048 2977.6660 2984.3657 3024.1155 3034.8661 3058.5087 3075.9023 3082.4629 3104.2926 3107.0856 3127.0322 3134.2578 3458.5015 3586.5770
redmass: 2.6090 2.6073 3.7433 2.1002 3.5439 1.1561 1.1631 3.7763 1.9702 3.0504 2.2565 2.8231 4.1733 3.3988 2.1884 1.4262 6.6308 3.5188 3.3574 1.1641 1.1481 2.6613 2.0195 1.2807 1.7047 1.4206 2.3590 1.3827 2.2518 2.2004 1.5091 2.0485 2.7305 1.5082 1.2289 1.1021 3.1805 1.7521 1.5286 1.2622 1.1429 1.4384 1.5234 1.2324 1.4501 4.6476 1.1980 2.6640 1.0429 1.0927 1.0718 1.0932 1.0877 2.6445 6.5563 6.4879 1.0953 1.0712 1.0641 1.0355 1.0596 1.0870 1.1017 1.0997 1.1000 1.1011 1.0867 1.0869 1.0962 1.0973 1.0449 1.0977
irintensity: 0.0303 1.4986 0.3295 4.0000 0.1895 1.5817 47.1531 0.1224 0.8448 20.9968 0.1271 0.0310 0.1954 17.2753 97.2876 174.2797 0.2490 0.1978 0.2584 3.4007 0.8484 16.8778 33.3735 2.8835 0.3709 0.3280 6.5677 0.0238 1.5828 1.9719 3.6013 17.6736 23.3241 25.3368 8.8961 0.2788 0.1713 0.2206 1.0734 0.3156 2.7503 2.6340 2.4079 0.1428 17.3024 3.3460 9.4809 3.7555 14.1187 1.4627 4.3562 6.9252 6.6505 34.5580 0.0169 0.4726 37.7493 97.1050 45.1842 34.0667 39.6962 26.6537 9.2045 32.5099 62.3815 41.4580 8.5030 24.2864 52.3483 1.1527 0.9486 0.4212
temp: 298.150 k
press: 1.00000 atm
elementType: 7 6 6 6 6 6 6 6 6 6 6 1 1 1 1 1 1 1 1 1 1 1 1 1 1 1
symmnumber: 1
zpe: 593775.6 jmol-1
zpe.correction: 0.226157 hartree
zpe.thermalcorrener: 0.238104 hartree
zpe.thermalcorrenthalpy: 0.239048 hartree
zpe.thermalcorrgfe: 0.186732 hartree
zpe.sumelectzpe: -443.969134 hartree
zpe.sumelectthermal: -443.957187 hartree
zpe.sumelectthermalent: -443.956243 hartree
zpe.sumelectthermalfe: -444.008559 hartree
dipole: 0.0368 -1.0919 0.8592
dipole: 1.3899
quadrupole: -60.2537 -63.4961 -69.5407
quadrupole: -5.9669 2.7825 1.0996
quadrupole: 4.1765 0.9341 -5.1105 -5.9669 2.7825 1.0996
hfenergy: -444.1952911 hartree
pointgroup: C01 [X(C10H15N1)]
dipole: 0.0090248 -0.3960256 0.3769819 debye
dipolederiv: -0.8791816 -0.1359299 0.0024383 -0.2108263 -0.4944699 0.2027212 -0.0113131 0.2202881 -0.3515934 0.3609644 0.0021447 0.0304721 0.0083717 -0.0711115 0.0050971 -0.0152671 -0.0013176 -0.0912512 -0.0981951 0.0059882 -0.0736514 0.0055044 0.1497386 0.0419627 -0.275732 0.0281607 0.0342767 0.297343 -0.000232 -0.0883063 -0.0159193 -0.0727028 -0.0034526 -0.0864852 -0.0005501 -0.0797534 0.072563 0.00197 0.0457445 0.0110281 0.1554623 -0.0042036 0.1795737 -0.0034512 0.0676026 -0.1133877 0.0274815 -0.0240532 0.0998046 0.0793962 -0.0206043 -0.007014 -0.0054264 -0.1527594 -0.0941305 -0.023213 -0.0168991 -0.1187159 0.0752785 0.0075114 0.0176771 0.0016545 -0.1517724 0.7164373 0.1001747 -0.0035548 0.0078334 0.3110839 -0.0761903 0.2088026 -0.0646316 0.2075827 -0.1085703 -0.028644 0.0121817 -0.104756 0.0808174 0.0021459 -0.0015308 -0.0010886 -0.1558857 -0.1238854 0.0236059 0.0097481 0.1167104 0.0808657 -0.0089672 -0.0055634 -0.0127343 -0.1576162 -0.0275734 0.001366 0.0428639 -0.0031211 0.0746499 -0.0041096 -0.0533908 -0.0045076 -0.0031448 -0.0263005 0.0351112 0.0459174 0.1025785 -0.0713267 -0.1280162 0.055405 -0.0774306 -0.0104465 0.0201952 -0.0278802 0.0298224 -0.0714035 -0.0701111 0.1033877 0.0305774 0.0678192 0.0184727 -0.0213805 0.0372167 -0.0214695 0.1112166 -0.0637769 0.1196668 -0.0442221 0.0819427 -0.0137462 -0.0141157 -0.0362179 -0.0147675 -0.1146988 -0.0857945 -0.1138093 -0.0316768 -0.0770043 0.0035094 0.015627 -0.1071189 0.0237706 -0.1000484 -0.0596718 0.0135625 0.0173189 0.0144108 0.1390737 0.0066782 0.1103164 0.0202181 0.1114699 -0.0632565 -0.0055184 0.0084148 -0.0071115 0.1361395 -0.1334056 -0.105712 0.0566845 -0.1507345 -0.1386693 0.1373909 0.0449199 0.0826863 -0.0329361 0.0073634 0.0453378 0.0370702 0.0422192 -0.0603081 -0.1224903 0.0667461 -0.0800224 -0.0115706 0.0043517 0.1103149 -0.0041485 0.1075841 -0.0635164 -0.0020892 0.0029189 -0.0024974 0.1412415 0.0064446 -0.1094464 0.0003466 -0.1060312 -0.0659972 0.0110284 0.0102007 0.0116216 0.1410249 0.0780028 0.0883289 -0.0576345 0.0587294 -0.0616956 0.1168449 -0.0336254 0.0645444 -0.000611 -0.2653665 0.0001453 0.072879 0.0004475 0.1055635 -0.0020952 0.086237 -0.0022154 0.0444213 0.0801826 -0.0907603 -0.0467556 -0.0593203 -0.0811058 -0.1094868 -0.0268429 -0.0566232 0.0171807 0.1552356 0.0333403 -0.0150568 0.1210569 0.094359 -0.1631014 0.0022443 -0.1159256 0.227196 0.0841041 0.042312 -0.0638603 0.1510207 0.316299 0.002815 -0.1383728 -0.0605905 0.0353655 unknown
polarizability: 160.1019248|-0.6961523|106.4541079|-4.047921|0.495934|75.409061 unknown
InChI: InChI=1S/C10H15N/c1-2-9-3-5-10(6-4-9)7-8-11/h3-6H,2,7-8,11H2,1H3
charge 0 multiplicity 1
26 atoms
N  4.586727 -0.043941 0.722314
C  0.945875 0.006716 -0.50433
C  2.464512 0.017208 -0.57443
C  -1.922041 -0.009142 -0.278573
C  -3.43591 -0.015818 -0.114305
C  0.207065 1.217235 -0.475292
C  0.224226 -1.212189 -0.421961
C  3.116537 -0.096603 0.83039
C  -1.201043 1.209411 -0.36549
C  -1.183662 -1.219936 -0.311559
C  -3.868432 0.050984 1.375636
H  2.824498 -0.827359 -1.19699
H  2.837398 0.946715 -1.041376
H  -3.877162 0.843884 -0.654627
H  -3.859699 -0.930969 -0.570854
H  0.74177 2.172739 -0.549031
H  0.770718 -2.163554 -0.457844
H  2.724617 -1.018224 1.325879
H  2.7841 0.760135 1.446361
H  -1.74985 2.159975 -0.355506
H  -1.719268 -2.176568 -0.25811
H  -3.467821 -0.81054 1.940131
H  -4.970248 0.043805 1.469335
H  -3.487137 0.971084 1.854644
H  4.994456 -0.814621 0.183313
H  5.076777 0.106273 1.608774
