program: Gaussian 09
title: 000144023
version: EM64L-G09RevD.01
frameworkgroup: C1[X(C6H4F3NO)]
method: RPBEPBE
basis: SDD
operation: Freq
keyword: #p
keyword: freq=noraman
keyword: PBEPBE/SDD
title: #p freq=noraman PBEPBE/SDD
converged: NO NO NO NO
title: Mulliken charges:
elementType: F F F O N C C C C C C H H H H
charge: -0.163410 -0.163456 -0.163510 -0.314018 0.040656 0.297060 -0.286897 -0.249804 0.276962 -0.195684 -0.195351 0.270748 0.265596 0.290510 0.290600
chargesum: 0.00000
title: Mulliken charges with hydrogens summed into heavy atoms:
elementType: F F F O N C C C C C C
charge: -0.163410 -0.163456 -0.163510 -0.314018 0.040656 0.297060 -0.016149 0.015792 0.276962 0.094826 0.095248
polarizability: 1.21280890e+02 -4.09394557e-01 7.71897820e+01 -7.78920007e-04 1.38903599e-03 3.68645894e+01
1716.lowfreq: -14.0349 -4.9483 -4.4721 -0.0001 0.0010 0.0013 21.0391 88.2174 163.9489
frequency: -10.8683 88.2171 163.9465 205.8555 294.8729 346.8876 360.0938 415.0515 449.8969 468.7150 522.2310 552.1437 570.1345 644.9990 684.9619 715.8839 815.9824 818.3450 832.2427 939.9763 952.3066 980.8029 995.7082 1015.8711 1027.9474 1099.2097 1181.7919 1264.0719 1280.2206 1291.1415 1306.5302 1452.3051 1468.2801 1526.7187 1633.8482 3171.5871 3180.9524 3214.5089 3218.2624
redmass: 5.9498 11.5580 9.6657 9.1359 12.7956 13.0895 9.0940 3.0353 7.7091 5.9110 8.8012 3.3742 11.1061 7.2174 10.0023 4.2701 1.2591 6.1529 1.6679 1.3561 1.4042 7.0588 8.3265 4.9845 3.1774 1.6551 1.1820 5.6180 3.8623 3.7308 1.2767 3.5976 2.5415 7.7225 5.9842 1.0918 1.0912 1.0958 1.0983
irintensity: 0.1841 5.8006 5.4313 3.2824 3.2745 6.7771 0.0105 0.0089 2.9913 2.1313 0.7003 21.0401 42.6272 1.9933 12.0034 1.1231 0.5320 0.0076 115.3776 11.0611 19.0720 209.1241 101.1835 145.3928 95.8848 4.7521 85.7116 65.0799 51.4933 376.0857 3.9907 14.9763 1.3541 4.5960 71.9596 0.2703 0.6010 1.1148 0.3016
temp: 298.150 k
press: 1.00000 atm
elementType: 9 9 9 8 7 6 6 6 6 6 6 1 1 1 1
symmnumber: 1
zpe: 246146.6 jmol-1
zpe.correction: 0.093752 hartree
zpe.thermalcorrener: 0.101960 hartree
zpe.thermalcorrenthalpy: 0.102904 hartree
zpe.thermalcorrgfe: 0.060157 hartree
zpe.sumelectzpe: -659.687865 hartree
zpe.sumelectthermal: -659.679657 hartree
zpe.sumelectthermalent: -659.678713 hartree
zpe.sumelectthermalfe: -659.721460 hartree
dipole: -0.0973 0.1040 0.0005
dipole: 0.1424
quadrupole: -83.4262 -52.0216 -64.3562
quadrupole: 0.0546 0.0007 0.0006
quadrupole: -16.8249 14.5798 2.2451 0.0546 0.0007 0.0006
hfenergy: -659.7816169 hartree
pointgroup: C01 [X(C6H4F3N1O1)]
dipole: 0.0381575 -0.0410248 0.0001904 debye
dipolederiv: -0.5717761 -0.2243674 -0.000508 -0.2201044 -0.6976726 -0.0006199 -0.0005176 -0.0006614 -0.2861865 -0.7251906 0.1110008 0.1938165 0.2307011 -0.3815554 -0.2094366 0.2551843 -0.1792651 -0.6410159 -0.7245002 0.1111211 -0.1938201 0.2308006 -0.3823736 0.2102714 -0.2549644 0.1799455 -0.6408711 -1.1596753 -0.0056007 -0.0007214 -0.0042136 -0.3144144 -0.0000138 -0.000771 -0.0000114 -0.3060617 1.1923185 0.0061194 0.000899 0.0101993 0.1559384 0.0000342 0.0009155 0.0000225 0.1338311 -0.736641 -0.0004206 -0.0004384 -0.0589493 -0.207555 -0.0000287 -0.0004858 0.0000214 -0.1965208 0.276498 -0.0052311 0.0002716 -0.1147435 0.084813 0.0000141 0.0000277 0.0001127 -0.0460199 0.2573039 -0.0020256 0.0002418 0.0952088 0.1004533 0.0002492 0.0003527 0.0001624 -0.0407563 2.4249064 0.004115 0.0008349 -0.1647719 1.3709065 -0.000282 0.0007776 -0.0001561 1.5809397 -0.2750883 -0.0737307 -0.0002072 -0.3750715 0.0342824 -0.0001656 -0.0005074 0.0000947 -0.1268224 -0.269146 0.0733203 -0.0000414 0.3617744 0.0374918 0.0004903 0.0002638 0.0002609 -0.1256188 0.1157424 -0.0516721 -0.0000859 -0.0369342 0.038036 -0.0001524 -0.00006 -0.0001559 0.1586241 0.096169 0.0586275 0.0000152 0.0454734 0.0313412 -0.0000962 0.0000102 -0.0000965 0.1548152 0.0489998 0.0354269 -0.0000908 -0.0045527 0.0655726 -0.0001339 -0.000111 -0.0000962 0.1908168 0.0500796 -0.0366828 -0.0001657 0.0051835 0.0647357 -0.0001299 -0.0001145 -0.0001774 0.1908466 unknown
polarizability: 121.277648|-0.554642|77.1929116|0.0751387|0.042316|36.8647016 unknown
InChI: InChI=1S/C6H4F3NO/c7-6(8,9)5-1-3-10(11)4-2-5/h1-4H
charge 0 multiplicity 1
15 atoms
F  -2.517339 -1.299255 -0.003679
F  -2.502409 0.674371 1.128599
F  -2.500929 0.676653 -1.131485
O  3.690305 0.008415 0.003204
N  2.366014 -0.000438 0.002045
C  -0.465242 -0.015981 -0.000366
C  0.265062 -1.22763 -0.001088
C  0.253772 1.206848 0.001472
C  -1.959514 -0.000246 -0.001702
C  1.66028 -1.208169 0.000223
C  1.647065 1.201819 0.002698
H  -0.248619 -2.192305 -0.002518
H  -0.264999 2.169718 0.002087
H  2.291494 -2.097385 -0.000118
H  2.270058 2.096785 0.00423
