program: Gaussian 09
title: 000143992
version: EM64L-G09RevD.01
frameworkgroup: C1[X(C5H6O)]
method: RPBEPBE
basis: SDD
operation: Freq
keyword: #p
keyword: freq=noraman
keyword: PBEPBE/SDD
title: #p freq=noraman PBEPBE/SDD
converged: NO NO NO NO
title: Mulliken charges:
elementType: O C C C C C H H H H H H
charge: -0.163806 0.296812 -0.747527 -0.747544 -0.237429 0.163098 0.230061 0.230059 0.258082 0.258067 0.230065 0.230063
chargesum: 0.00000
title: Mulliken charges with hydrogens summed into heavy atoms:
elementType: O C C C C C
charge: -0.163806 0.296812 -0.029325 -0.029350 -0.237429 0.163098
polarizability: 1.09074683e+02 8.60559298e-04 4.34993665e+01 -2.68862479e-04 -1.90926716e-06 3.27936280e+01
1716.lowfreq: -46.9290 -4.1955 -0.0007 -0.0006 -0.0006 10.6161 27.3962 66.4995 130.7358
frequency: -46.3468 66.3740 130.6776 171.9203 341.7397 414.6077 454.2243 462.8119 605.6376 653.1633 909.7464 924.2253 958.2851 1069.0439 1182.5515 1213.4972 1370.4619 1382.3338 1442.3616 1447.5200 1459.6633 1466.6861 1702.9362 2237.0360 2962.5641 2968.1816 3036.0595 3042.2990 3112.3543 3115.2263
redmass: 5.1962 1.0193 1.5809 2.1291 2.4486 11.7498 2.5727 4.1838 9.3683 4.3110 1.2125 1.4733 2.0865 1.7324 2.8508 3.9162 1.2154 1.1922 1.0501 1.0543 1.0851 1.0443 9.2442 12.1691 1.0380 1.0382 1.0958 1.0951 1.0988 1.0992
irintensity: 3.3701 0.0000 1.6141 0.2143 0.5337 15.9053 4.5496 9.5880 10.6956 0.1124 0.0000 0.4872 5.5993 10.1948 121.5792 38.7142 34.6728 21.1521 8.0685 0.0000 9.0528 35.4952 1.6953 1052.8410 2.3868 23.7576 0.0002 29.9330 19.8907 9.8615
temp: 298.150 k
press: 1.00000 atm
elementType: 8 6 6 6 6 6 1 1 1 1 1 1
symmnumber: 1
zpe: 241072.6 jmol-1
zpe.correction: 0.091820 hartree
zpe.thermalcorrener: 0.098455 hartree
zpe.thermalcorrenthalpy: 0.099399 hartree
zpe.thermalcorrgfe: 0.060963 hartree
zpe.sumelectzpe: -268.841329 hartree
zpe.sumelectthermal: -268.834693 hartree
zpe.sumelectthermalent: -268.833749 hartree
zpe.sumelectthermalfe: -268.872185 hartree
dipole: -4.7572 0.0009 0.0001
dipole: 4.7572
quadrupole: -41.1701 -34.1429 -35.0426
quadrupole: 0.0006 -0.0001 0.0000
quadrupole: -4.3849 2.6423 1.7426 0.0006 -0.0001 0.0000
hfenergy: -268.9331483 hartree
pointgroup: C01 [X(C5H6O1)]
dipole: 1.8716406 0.0004911 -0.0000265 debye
dipolederiv: -1.7975106 0.0000624 0.0000026 -0.0003579 -0.1924658 0. -0.0000068 0. -0.2783428 1.2822483 0.0000864 -0.0000151 0.0000751 0.7061005 0. -0.0000668 0. 0.0426992 -0.2731263 0.184195 0.0000089 0.1088651 -0.1944521 -0.0000093 0.0000532 -0.0000246 0.0337836 -0.2730184 -0.1841876 0.000009 -0.1089095 -0.1946191 0.0000095 0.0000536 0.0000249 0.0338078 -1.7260878 -0.0001389 0.000007 0.0001427 -0.5356475 0. 0.0000031 0. -0.2410778 2.6475904 -0.0000267 -0.000003 0.0002397 0.2217847 0. 0.0000099 0. 0.2792662 0.0167195 0.003457 0.1094518 0.0456195 0.0759807 0.0313746 0.1367088 -0.0054787 -0.0266322 0.0166867 0.0034537 -0.1094649 0.0456049 0.0759779 -0.0313798 -0.1367306 0.0054818 -0.0266041 0.0365782 -0.1143851 0.0000085 -0.0560566 -0.0573287 0.0000091 -0.0000011 0.0000131 0.118167 0.0364645 0.1144323 0.0000085 0.0560856 -0.0572561 -0.0000091 -0.0000011 -0.0000131 0.1181654 0.0167442 -0.0034759 0.1094631 -0.0456616 0.0759641 -0.0313204 0.1367061 0.0055494 -0.0266304 0.0167113 -0.0034727 -0.1094763 -0.045647 0.0759614 0.0313255 -0.1367281 -0.0055526 -0.0266019 unknown
polarizability: 109.0746832|0.0044778|43.4993668|-0.0002689|0.0000019|32.793628 unknown
InChI: InChI=1S/C5H6O/c1-5(2)3-4-6/h1-2H3
charge 0 multiplicity 1
12 atoms
O  -2.867525 -0.000306 0.000012
C  0.998254 0.000047 0.00003
C  1.809565 -1.286634 0.0000
C  1.808878 1.287163 0.0000
C  -0.354318 -0.000321 0.00002
C  -1.642569 -0.000105 0.000016
H  2.47322 -1.320397 -0.887275
H  2.473352 -1.320359 0.887175
H  1.164912 -2.179206 0.000061
H  1.163764 2.179406 0.000061
H  2.472517 1.321274 -0.887269
H  2.47265 1.321237 0.887168
