program: Gaussian 09
title: 000010246
version: EM64L-G09RevD.01
frameworkgroup: C1[X(C15H20N2O)]
method: RPBEPBE
basis: SDD
operation: Freq
keyword: #p
keyword: freq=noraman
keyword: PBEPBE/SDD
title: #p freq=noraman PBEPBE/SDD
converged: NO YES NO NO
title: Mulliken charges:
elementType: O N N C C C C C C C C C C C C C C C H H H H H H H H H H H H H H H H H H H H
charge: -0.293263 -0.107826 -0.215381 -0.108666 -0.023081 -0.257347 -0.552062 -0.403541 -0.451864 -0.417499 -0.365763 0.484289 -0.419497 -0.396781 -0.444290 0.126839 -0.149427 -0.345423 0.212372 0.184609 0.235094 0.225329 0.238488 0.229716 0.185110 0.217977 0.193956 0.262470 0.250990 0.169557 0.214177 0.219315 0.189871 0.194926 0.212453 0.234700 0.227940 0.241534
chargesum: 0.00000
title: Mulliken charges with hydrogens summed into heavy atoms:
elementType: O N N C C C C C C C C C C C C C C C
charge: -0.293263 -0.107826 -0.215381 0.103706 0.161527 -0.022253 -0.088245 0.011285 -0.039931 0.095961 0.017971 0.484289 -0.010311 0.010597 -0.209590 0.126839 0.078513 -0.103889
polarizability: 1.85964304e+02 -1.80706432e-01 1.74782778e+02 -1.81989886e+01 5.02485814e+00 1.43197474e+02
1716.lowfreq: -29.8795 -10.2315 -0.0006 0.0003 0.0004 10.1116 39.4348 58.3124 89.9720
frequency: 39.3977 57.8674 89.9168 132.4417 184.5167 217.3338 242.2311 274.7500 283.0654 300.6334 317.0040 348.6273 358.2368 386.1077 434.5462 445.1430 465.3078 489.4194 498.9476 508.1906 538.8870 564.3644 608.8612 642.4153 705.9336 712.3766 730.2926 762.1761 791.5289 795.9036 827.6848 852.2280 855.2130 872.8774 886.2952 898.1715 910.6707 924.4866 951.4208 976.4362 976.6898 1001.5585 1026.8774 1038.3714 1050.9066 1061.6679 1075.6003 1077.7066 1104.6981 1117.7856 1123.4140 1131.0335 1133.0579 1163.8235 1171.8102 1182.4982 1192.0622 1210.8802 1226.3665 1234.5998 1245.8277 1263.6042 1266.9444 1271.7187 1291.9940 1306.1767 1322.2184 1330.9198 1339.5745 1341.1528 1344.8135 1347.4775 1349.5798 1355.0078 1357.1094 1389.5618 1398.3147 1434.0910 1450.7675 1456.5847 1460.8698 1467.3793 1471.2123 1479.0026 1487.1857 1548.6331 1560.4460 1645.7322 2762.7461 2811.0524 2827.6024 2967.6503 2983.9276 2986.9426 2988.6780 2996.5200 3012.1349 3017.9605 3022.1499 3030.2898 3036.6471 3046.4520 3050.1514 3056.4663 3072.8407 3131.7652 3165.1196 3181.9259
redmass: 4.0274 4.8494 3.3399 3.0621 3.4725 3.1444 3.0375 3.6055 3.2070 2.8065 2.0531 2.4395 2.7055 2.9542 3.7157 3.7006 3.8223 4.0727 3.4022 2.8667 2.8864 2.8765 4.8305 4.6237 3.7316 3.8336 2.1537 3.4526 2.0243 2.6321 1.6541 1.5635 2.2879 2.6870 2.3226 2.7774 1.6553 2.0642 1.9581 1.4480 1.7976 2.6303 1.7556 2.4676 2.2149 1.9390 1.7920 1.5374 2.0458 2.1525 1.8706 1.8847 2.0188 1.2700 1.7060 1.6284 2.3328 1.6202 1.7571 1.2382 1.2514 1.5657 1.2928 1.4416 1.5180 1.6022 1.3997 1.4141 1.4366 1.5375 1.4488 1.4716 1.4659 1.5471 1.5091 1.4625 2.1142 1.7335 1.0993 1.0889 1.0942 1.1063 1.1000 1.0959 1.3891 6.4281 7.4616 7.5928 1.0791 1.0711 1.0704 1.0632 1.0621 1.0640 1.0617 1.0714 1.0765 1.0872 1.0864 1.0861 1.0963 1.1023 1.1036 1.1034 1.0931 1.0885 1.0934 1.0966
irintensity: 0.1391 1.4375 3.6945 0.5571 1.7439 1.1291 2.3174 0.8875 2.5133 0.0606 2.7086 4.4027 2.2420 2.3588 0.7783 0.2611 0.7885 1.2697 0.4370 3.0525 2.8300 0.8844 1.9378 0.6466 0.2325 4.7932 18.8037 6.3144 55.5366 8.4072 3.4853 3.6011 3.9883 0.7464 1.3246 1.4251 1.1121 0.4421 1.6247 3.2044 10.3485 2.6588 9.7365 4.6956 2.3468 6.7433 12.5603 11.6399 28.5569 27.4704 12.0134 11.9741 19.8372 10.2731 2.0074 13.3394 6.7409 0.7862 7.8392 5.2083 4.1898 12.5488 15.0373 3.0368 18.7184 6.4917 2.6783 2.4548 3.6795 2.7908 2.0882 5.8060 21.5177 6.9981 1.8730 2.0817 5.0674 19.7813 7.6454 7.2149 13.3069 5.7574 8.4418 7.1076 11.7740 113.7802 165.7498 225.2289 71.6923 38.7858 229.6912 42.8398 24.4375 24.5512 22.4611 15.7879 59.5887 29.8449 43.9806 44.0456 44.5889 29.3058 28.5049 81.7339 8.1305 19.9914 8.6015 7.9969
temp: 298.150 k
press: 1.00000 atm
elementType: 8 7 7 6 6 6 6 6 6 6 6 6 6 6 6 6 6 6 1 1 1 1 1 1 1 1 1 1 1 1 1 1 1 1 1 1 1 1
symmnumber: 1
zpe: 857221.5 jmol-1
zpe.correction: 0.326498 hartree
zpe.thermalcorrener: 0.340792 hartree
zpe.thermalcorrenthalpy: 0.341736 hartree
zpe.thermalcorrgfe: 0.285761 hartree
zpe.sumelectzpe: -766.982075 hartree
zpe.sumelectthermal: -766.967781 hartree
zpe.sumelectthermalent: -766.966837 hartree
zpe.sumelectthermalfe: -767.022812 hartree
dipole: -3.2777 -4.6953 0.9778
dipole: 5.8091
quadrupole: -106.7449 -114.1658 -102.7698
quadrupole: -11.2456 -2.9164 1.2695
quadrupole: 1.1486 -6.2723 5.1237 -11.2456 -2.9164 1.2695
hfenergy: -767.3085731 hartree
pointgroup: C01 [X(C15H20N2O1)]
dipole: -1.3291241 1.847087 -0.2122363 debye
polarizability: 186.2763583|-1.0980112|173.6153373|17.6787476|8.073023|144.0528603 unknown
InChI: InChI=1S/C15H20N2O/c18-15-6-3-5-14-11-8-12(10-17(14)15)13-4-1-2-7-16(13)9-11/h3,5-6,11-13H,1-2,4,7-10H2
charge 0 multiplicity 1
38 atoms
O  2.327684 -2.547019 -0.249623
N  -1.513802 0.601343 0.515626
N  1.422326 -0.378798 -0.394896
C  -0.722287 -0.062319 -1.763956
C  -1.935104 0.016051 -0.786966
C  0.337118 1.863495 -0.629296
C  -0.155429 1.354581 -2.000522
C  -0.869483 1.923523 0.34809
C  -2.623437 -1.353047 -0.584023
C  0.41985 -0.997575 -1.313582
C  -2.623949 0.692536 1.500904
C  1.436182 0.969161 -0.076901
C  -3.797688 -1.262805 0.414747
C  -3.290211 -0.672088 1.747948
C  2.431395 1.47528 0.759574
C  2.40382 -1.32459 0.108256
C  3.418769 0.596836 1.301135
C  3.40356 -0.757698 0.991813
H  -1.113299 -0.475706 -2.714417
H  -2.689002 0.696351 -1.279277
H  0.746923 2.886232 -0.71592
H  -0.943043 2.026081 -2.392029
H  0.6688 1.335536 -2.738251
H  -0.530523 2.272453 1.341191
H  -1.592371 2.686412 -0.050175
H  -1.889227 -2.083725 -0.19569
H  -2.971018 -1.723008 -1.568456
H  0.045382 -1.90385 -0.810833
H  0.981674 -1.363415 -2.194308
H  -3.406451 1.417715 1.148407
H  -2.207842 1.093692 2.444578
H  -4.244831 -2.261923 0.573319
H  -4.595305 -0.61094 0.001568
H  -4.122106 -0.547318 2.467118
H  -2.551765 -1.359749 2.202822
H  2.436488 2.544063 0.989377
H  4.195366 0.997482 1.962867
H  4.145138 -1.455852 1.389181
