program: Gaussian 09
title: 000143978
version: EM64L-G09RevD.01
frameworkgroup: C1[X(C14H20O)]
method: RPBEPBE
basis: SDD
operation: Freq
keyword: #pfreq=noraman
keyword: PBEPBE/SDD
title: #p freq=noraman PBEPBE/SDD
converged: YES YES NO NO
title: Mulliken charges:
elementType: O C C C C C C C C C C C C C C H H H H H H H H H H H H H H H H H H H H
charge: -0.267663 0.225777 -0.582809 -0.587300 0.285096 0.416176 -0.743756 -0.745841 -0.745561 -0.421973 -0.394068 -0.377545 -0.376609 0.319504 -0.537564 0.232877 0.231315 0.231880 0.234404 0.209679 0.206547 0.238314 0.214531 0.213652 0.212862 0.240329 0.206309 0.210923 0.238443 0.243806 0.237108 0.247850 0.219756 0.219580 0.243972
chargesum: 0.00000
title: Mulliken charges with hydrogens summed into heavy atoms:
elementType: O C C C C C C C C C C C C C C
charge: -0.267663 0.225777 -0.118617 -0.121016 0.285096 0.416176 -0.089215 -0.104797 -0.088000 -0.183531 -0.150262 -0.140437 -0.128759 0.319504 0.145744
polarizability: 2.03967644e+02 8.71134661e+00 1.16164406e+02 -1.00787395e-01 6.83792777e+00 1.37841643e+02
1716.lowfreq: -18.9835 -14.6642 -0.0007 -0.0006 -0.0001 4.7099 6.0191 52.1877 69.4908
frequency: -16.8434 52.1100 69.4465 108.2111 135.8543 176.1598 182.3330 215.8369 234.8973 248.7470 258.7201 266.0162 276.3779 304.9249 340.0074 358.1618 380.5286 392.6357 418.5103 438.1236 448.3421 502.5820 544.7595 551.1313 588.1526 633.5343 717.3944 737.7336 784.3216 802.2050 816.6538 838.4829 850.4255 911.7479 916.2572 923.5604 928.3931 934.4941 942.8062 947.0525 968.9744 988.9803 1003.1644 1018.6976 1028.1914 1054.8094 1074.7959 1089.1018 1111.4944 1112.2617 1155.6810 1160.7466 1175.4563 1185.8922 1214.9466 1218.1362 1225.9719 1272.8734 1298.3736 1316.9634 1360.3492 1371.0156 1375.2153 1400.2889 1412.7922 1435.8051 1442.1069 1458.9086 1462.3643 1465.7249 1470.4604 1472.6811 1477.6873 1479.7539 1489.9564 1498.3068 1501.5553 1576.7910 1620.7053 2956.3800 2970.1356 2971.9951 2978.8465 3043.2367 3059.8526 3060.8869 3069.2753 3074.7601 3080.0583 3082.9981 3096.5041 3104.5015 3121.9977 3128.4685 3132.5315 3158.5679 3164.3868 3188.6950 3204.5313
redmass: 2.5160 3.4513 3.6493 3.6174 3.2884 1.2169 2.6088 2.0244 1.5452 1.6332 1.3417 1.2590 2.4757 2.6755 3.0264 1.9491 3.3463 2.4492 2.9646 3.2717 3.4001 3.0576 3.5320 2.4288 4.1219 6.8021 2.7767 3.4653 3.2046 1.2318 1.3258 1.5596 2.1322 3.6725 1.6018 1.8801 2.3827 1.3846 1.2198 1.4519 1.3406 8.2235 2.8635 1.4131 1.4321 1.2406 1.3665 1.9646 1.3341 1.2708 1.3346 1.3006 1.3576 2.1025 2.9425 3.0759 3.1740 3.3055 1.3027 3.3804 5.8117 1.2033 1.2112 1.2138 3.7762 1.1682 1.0803 1.0557 1.1083 1.0506 1.0490 1.0726 1.0575 1.1716 1.0547 1.0796 2.4202 7.2812 6.4156 1.0330 1.0351 1.0354 1.0360 1.1038 1.0999 1.0993 1.0979 1.0992 1.0979 1.0983 1.0527 1.0620 1.0989 1.0885 1.0883 1.0942 1.0958 1.1154 1.1142
irintensity: 0.0623 1.8246 0.3266 4.1343 0.7962 0.1144 1.3161 1.2549 0.1543 0.4846 0.1255 0.8952 1.2148 0.5803 0.3745 0.2760 1.1240 0.3980 0.0287 1.3152 0.2396 6.8129 1.8949 25.2193 9.4155 0.9428 8.2313 3.7003 3.6434 1.5349 16.5874 51.1902 0.0299 6.6199 0.2865 2.6513 7.5211 0.2116 0.1126 1.1325 0.0209 49.6354 9.1551 0.8570 0.7680 22.0489 6.8852 12.3024 8.2062 1.3662 0.3022 0.1079 79.9369 19.4590 1.7194 5.1292 178.6766 9.7385 2.2778 14.7675 8.5816 23.4927 12.8162 21.7839 2.5947 9.2950 4.9507 0.6330 11.0677 12.8345 1.6977 54.3511 12.7791 5.3577 15.3381 41.2557 99.5814 7.6434 45.8791 70.4266 38.6279 22.9576 34.3514 50.3544 8.0912 6.3303 100.0675 11.2914 21.4391 63.3255 29.3043 13.1231 32.0743 7.8310 14.6396 17.6938 4.3747 0.3720 39.5369
temp: 298.150 k
press: 1.00000 atm
elementType: 8 6 6 6 6 6 6 6 6 6 6 6 6 6 6 1 1 1 1 1 1 1 1 1 1 1 1 1 1 1 1 1 1 1 1
symmnumber: 1
zpe: 791175.5 jmol-1
zpe.correction: 0.301343 hartree
zpe.thermalcorrener: 0.316321 hartree
zpe.thermalcorrenthalpy: 0.317265 hartree
zpe.thermalcorrgfe: 0.260720 hartree
zpe.sumelectzpe: -619.516476 hartree
zpe.sumelectthermal: -619.501498 hartree
zpe.sumelectthermalent: -619.500554 hartree
zpe.sumelectthermalfe: -619.557099 hartree
dipole: -0.3965 -0.6519 -1.4187
dipole: 1.6109
quadrupole: -81.9557 -94.7756 -88.9468
quadrupole: 2.3999 7.5566 2.4411
quadrupole: 6.6037 -6.2162 -0.3875 2.3999 7.5566 2.4411
hfenergy: -619.8178192 hartree
pointgroup: C01 [X(C14H20O1)]
dipole: -0.1470394 -0.4083533 -0.4618414 debye
polarizability: 204.1744631|7.3586553|121.7753328|-0.6838608|11.9710081|132.0238973 unknown
InChI: InChI=1S/C14H20O/c1-13(2,3)14(9-10-14)11-5-7-12(15-4)8-6-11/h5-8H,9-10H2,1-4H3
charge 0 multiplicity 1
35 atoms
O  -4.078502 0.057835 0.421978
C  1.641484 0.410019 -0.317432
C  2.115081 0.990294 -1.662903
C  2.194959 1.845264 -0.385809
C  2.482482 -0.716642 0.385426
C  0.134532 0.30356 -0.151029
C  2.062238 -2.104854 -0.173645
C  4.011093 -0.554143 0.159865
C  2.219704 -0.682604 1.9171
C  -0.659877 -0.404262 -1.084709
C  -0.530557 0.915406 0.947188
C  -2.06182 -0.518334 -0.939956
C  -1.923525 0.815655 1.112868
C  -2.695927 0.094067 0.168656
C  -4.919034 -0.667177 -0.532261
H  1.349905 1.255323 -2.399135
H  3.054065 0.638723 -2.098975
H  3.186561 2.058315 0.022668
H  1.482134 2.669598 -0.285299
H  2.224122 -2.158142 -1.266852
H  2.661514 -2.905422 0.299903
H  0.996887 -2.314296 0.026104
H  4.395569 0.40184 0.558335
H  4.288155 -0.624194 -0.90753
H  4.542329 -1.366803 0.689629
H  1.156028 -0.865268 2.148817
H  2.817084 -1.46267 2.425875
H  2.502256 0.297752 2.345315
H  -0.173562 -0.870648 -1.949658
H  0.056569 1.486128 1.675886
H  -2.63736 -1.072029 -1.688096
H  -2.435169 1.289474 1.956313
H  -4.643047 -1.738875 -0.581305
H  -4.856059 -0.222505 -1.544844
H  -5.944513 -0.566584 -0.147086
