program: Gaussian 09
title: 000143974
version: EM64L-G09RevD.01
frameworkgroup: C1[X(C13H18)]
method: RPBEPBE
basis: SDD
operation: Freq
keyword: #p
keyword: freq=noraman
keyword: PBEPBE/SDD
title: #p freq=noraman PBEPBE/SDD
converged: YES YES NO NO
title: Mulliken charges:
elementType: C C C C C C C C C C C C C H H H H H H H H H H H H H H H H H H
charge: 0.228229 -0.582730 -0.585719 0.284407 0.401780 -0.743398 -0.744588 -0.744289 -0.415200 -0.416074 -0.245577 -0.245561 -0.241118 0.234600 0.232635 0.232561 0.234925 0.210330 0.207110 0.239071 0.214227 0.213511 0.214612 0.239519 0.206949 0.211210 0.241389 0.242239 0.224054 0.224058 0.226841
chargesum: 0.00000
title: Mulliken charges with hydrogens summed into heavy atoms:
elementType: C C C C C C C C C C C C C
charge: 0.228229 -0.115495 -0.118234 0.284407 0.401780 -0.086887 -0.102238 -0.086611 -0.173812 -0.173835 -0.021523 -0.021503 -0.014277
polarizability: 1.63222163e+02 9.87848518e+00 1.03816613e+02 -2.93605924e-02 8.38546327e-02 1.30189342e+02
1716.lowfreq: -13.9077 -10.8931 -8.6032 -0.0010 -0.0009 -0.0008 35.9600 75.4836 93.1007
frequency: 32.5419 75.3249 93.0850 173.2061 187.9124 243.9819 251.3721 270.2795 278.5573 281.9500 325.9115 354.6719 364.9784 393.5021 409.5584 413.3763 504.6447 540.7350 542.1354 616.7173 640.2603 709.8237 749.3517 769.3859 809.0086 849.1532 857.1914 913.6518 913.8429 916.3318 925.4608 936.1470 936.7187 942.9967 978.9157 991.6426 993.4789 1018.1050 1023.5586 1029.3281 1056.7555 1072.4728 1084.9151 1090.6789 1164.0414 1170.8747 1183.5579 1187.9245 1214.2680 1218.9926 1270.4812 1314.6275 1315.6868 1371.9808 1373.3013 1374.8273 1400.5003 1431.4076 1443.0618 1461.4096 1462.4436 1473.2860 1478.0411 1482.1622 1483.6621 1491.8472 1500.7497 1584.8920 1610.1001 2970.6550 2973.0469 2982.3560 3060.4001 3062.1200 3070.9604 3077.5697 3082.7546 3083.8154 3098.4395 3106.1783 3117.4693 3121.7851 3135.0403 3143.5446 3160.5579 3191.0338 3206.5906
redmass: 2.7223 3.4672 3.8781 2.2707 1.3313 3.6432 1.4098 1.3611 1.8039 1.6349 2.7933 2.9988 1.8527 2.3768 2.8302 2.5561 2.7537 3.0936 3.5693 6.3924 3.9610 1.6692 2.7220 1.6590 1.2388 2.0604 1.2445 3.1638 1.8888 1.7695 1.7185 1.6402 1.6477 1.2011 1.3784 4.7919 1.3862 1.4332 2.4269 1.4206 1.2336 1.4178 1.5317 1.8729 1.3017 1.0523 2.0284 1.2243 3.0341 3.0672 3.2448 1.3593 3.3835 7.1620 1.2169 1.2063 1.2118 2.2100 1.0773 1.0570 1.1017 1.0502 1.1231 1.4987 1.4944 1.0551 1.0617 6.0699 6.0901 1.0351 1.0355 1.0358 1.0999 1.0992 1.0977 1.0998 1.0983 1.0970 1.0530 1.0620 1.0843 1.0872 1.0919 1.0963 1.1015 1.1152 1.1141
irintensity: 0.0031 0.0331 0.4554 0.0482 0.0252 0.3456 0.0216 0.0739 0.1518 0.3717 0.0628 0.0483 0.1695 0.0378 0.0014 1.0979 2.0405 15.3123 1.5777 0.0044 1.5227 58.9325 2.4067 30.0495 8.0501 1.1458 0.0769 7.6783 0.8772 0.1217 3.8933 4.1757 3.9282 0.0150 0.0029 0.0144 0.2714 1.1077 13.7850 0.7028 22.8434 11.1170 1.5202 11.2242 0.0078 0.0033 27.6524 3.1844 4.5179 4.4769 12.8958 0.8491 4.2714 0.6691 14.8623 22.5779 20.3864 7.8545 3.6905 0.7695 8.3714 2.5129 12.0835 10.8862 11.9108 15.6326 22.0915 1.4273 7.3552 37.3811 21.6677 34.4822 8.5078 12.8874 93.8785 0.2772 58.8706 30.3680 28.8792 11.5947 4.5991 0.0390 19.0147 45.1296 22.7170 0.4160 35.9455
temp: 298.150 k
press: 1.00000 atm
elementType: 6 6 6 6 6 6 6 6 6 6 6 6 6 1 1 1 1 1 1 1 1 1 1 1 1 1 1 1 1 1 1
symmnumber: 1
zpe: 709816.6 jmol-1
zpe.correction: 0.270355 hartree
zpe.thermalcorrener: 0.283404 hartree
zpe.thermalcorrenthalpy: 0.284348 hartree
zpe.thermalcorrgfe: 0.231602 hartree
zpe.sumelectzpe: -505.164685 hartree
zpe.sumelectthermal: -505.151636 hartree
zpe.sumelectthermalent: -505.150692 hartree
zpe.sumelectthermalfe: -505.203439 hartree
dipole: 0.2894 -0.1597 -0.0014
dipole: 0.3306
quadrupole: -75.4202 -84.0096 -76.0683
quadrupole: 0.7259 -0.0057 0.0297
quadrupole: 3.0792 -5.5103 2.4311 0.7259 -0.0057 0.0297
hfenergy: -505.4350403 hartree
pointgroup: C01 [X(C13H18)]
dipole: -0.1110612 -0.0640279 -0.0219838 debye
polarizability: 163.961418|-6.9667544|105.9576034|-2.1299522|-8.3576921|127.3090973 unknown
InChI: InChI=1S/C13H18/c1-12(2,3)13(9-10-13)11-7-5-4-6-8-11/h4-8H,9-10H2,1-3H3
charge 0 multiplicity 1
31 atoms
C  -0.914987 0.522214 0.178573
C  -1.363873 1.464986 1.309944
C  -1.352573 1.961785 -0.14712
C  -1.829467 -0.684776 -0.243408
C  0.582227 0.265489 0.101476
C  -1.531057 -1.910455 0.665123
C  -3.343909 -0.359756 -0.121335
C  -1.539338 -1.06404 -1.722957
C  1.293678 -0.249269 1.216864
C  1.309546 0.540132 -1.086209
C  2.683352 -0.493953 1.146473
C  2.699312 0.297879 -1.163751
C  3.392683 -0.223786 -0.046921
H  -0.593311 1.856004 1.981481
H  -2.335388 1.307126 1.785525
H  -2.316473 2.130592 -0.634372
H  -0.57563 2.678887 -0.429633
H  -1.716653 -1.670501 1.729057
H  -2.183936 -2.759494 0.387524
H  -0.4830 -2.242661 0.566094
H  -3.641373 -0.133552 0.91809
H  -3.928472 -1.241264 -0.444424
H  -3.646599 0.485904 -0.764464
H  -0.489892 -1.377108 -1.862019
H  -2.188385 -1.903325 -2.036861
H  -1.735831 -0.209211 -2.397407
H  0.750882 -0.450001 2.148187
H  0.779124 0.956633 -1.950794
H  3.212489 -0.889508 2.021171
H  3.240872 0.520265 -2.090474
H  4.47148 -0.408735 -0.102833
