program: Gaussian 09
title: 000143973
version: EM64L-G09RevD.01
frameworkgroup: C1[X(C12H16)]
method: RPBEPBE
basis: SDD
operation: Freq
keyword: #p
keyword: freq=noraman
keyword: PBEPBE/SDD
title: #p freq=noraman PBEPBE/SDD
converged: YES YES NO NO
title: Mulliken charges:
elementType: C C C C C C C C C C C C H H H H H H H H H H H H H H H H
charge: 0.235308 -0.575911 -0.576616 -0.051507 0.416161 -0.733763 -0.734135 -0.417812 -0.417739 -0.240900 -0.240949 -0.241565 0.236809 0.227237 0.227229 0.236915 0.186621 0.210940 0.215241 0.229989 0.230220 0.210990 0.215391 0.238744 0.238507 0.223907 0.223928 0.226759
chargesum: 0.00000
title: Mulliken charges with hydrogens summed into heavy atoms:
elementType: C C C C C C C C C C C C
charge: 0.235308 -0.111866 -0.112472 0.135114 0.416161 -0.077593 -0.077534 -0.179068 -0.179231 -0.016993 -0.017021 -0.014805
polarizability: 1.46726818e+02 9.59444230e+00 9.46476488e+01 -2.03585241e-01 6.01248645e-01 1.23163792e+02
1716.lowfreq: -17.7450 -7.7944 -0.0006 -0.0005 -0.0004 11.3700 39.2809 84.7555 93.5855
frequency: 38.9848 84.6838 93.5751 166.9915 215.2809 221.5704 232.2844 256.1194 268.7588 337.5786 351.5824 406.4596 436.0172 460.9501 540.7952 550.9741 616.4749 671.1298 707.0034 768.8920 779.2996 825.2533 854.9351 887.8102 908.1801 917.9003 919.7565 930.0911 945.7166 961.3742 976.6985 991.3781 993.0692 1022.8832 1048.6297 1059.2790 1071.7924 1083.3076 1124.2972 1131.9359 1164.1172 1167.2762 1170.8020 1185.5851 1250.7996 1290.4925 1304.6534 1313.6480 1367.6469 1372.2297 1373.2382 1390.3057 1431.4717 1446.9719 1464.5402 1472.2353 1472.5143 1477.0433 1485.6407 1489.5554 1585.3143 1611.5181 2951.4232 2971.4983 2974.5365 3064.6002 3068.8593 3070.8255 3076.2864 3084.5604 3094.4634 3117.6306 3121.9261 3134.9894 3143.7928 3160.7079 3182.2140 3198.4837
redmass: 3.3536 2.7694 3.7010 3.2175 3.0691 1.5923 1.3201 1.0724 3.0975 2.7761 2.4644 2.8289 2.9252 2.9218 3.5850 2.8899 6.3883 4.1334 1.6626 1.9479 1.4158 1.3719 1.2480 2.9709 1.5923 1.5053 1.9803 1.1596 2.3290 1.7753 1.3862 5.8829 1.3206 2.3544 1.2400 1.4463 1.4149 1.5432 2.1915 2.2161 1.3617 2.0570 1.0525 1.1150 2.1112 2.6068 1.3736 1.3566 1.9549 2.5217 1.7957 1.2116 2.2089 1.0864 1.0455 1.0816 1.2202 1.0626 2.3848 1.0634 6.0964 6.1134 1.0832 1.0348 1.0360 1.1000 1.0990 1.1000 1.0991 1.0511 1.0622 1.0843 1.0873 1.0920 1.0964 1.1015 1.1163 1.1148
irintensity: 0.0010 0.0409 0.4348 0.0561 0.3316 0.0119 0.0105 0.3768 0.6417 0.0690 0.1670 0.0016 2.4480 2.6159 2.0446 17.6018 0.0032 3.1774 58.4345 34.2678 0.2605 1.9552 0.0856 8.6657 0.3855 1.1812 7.6119 0.1813 6.6523 1.6723 0.0234 0.0218 0.2761 14.2445 16.9430 16.6464 11.0498 1.7082 6.1123 1.0269 0.2808 9.6657 0.0073 0.1356 0.5371 6.6912 0.3818 0.8805 8.7807 10.4386 11.8122 13.4452 8.3108 10.0218 3.2682 3.8646 15.0983 7.9930 12.8610 14.3152 1.4365 7.4252 34.8247 36.4165 19.9899 7.9618 73.6251 11.2770 66.8471 21.6277 13.5496 4.3626 0.0362 18.9868 45.4914 21.9031 0.0071 34.2936
temp: 298.150 k
press: 1.00000 atm
elementType: 6 6 6 6 6 6 6 6 6 6 6 6 1 1 1 1 1 1 1 1 1 1 1 1 1 1 1 1
symmnumber: 1
zpe: 637394.8 jmol-1
zpe.correction: 0.242771 hartree
zpe.thermalcorrener: 0.254610 hartree
zpe.thermalcorrenthalpy: 0.255555 hartree
zpe.thermalcorrgfe: 0.205154 hartree
zpe.sumelectzpe: -465.945302 hartree
zpe.sumelectthermal: -465.933462 hartree
zpe.sumelectthermalent: -465.932518 hartree
zpe.sumelectthermalfe: -465.982919 hartree
dipole: 0.2908 -0.1133 0.0025
dipole: 0.3121
quadrupole: -68.3858 -77.4623 -69.5265
quadrupole: 0.6595 -0.0124 0.1611
quadrupole: 3.4057 -5.6707 2.2650 0.6595 -0.0124 0.1611
hfenergy: -466.1880726 hartree
pointgroup: C01 [X(C12H16)]
dipole: 0.1117026 0.0477465 -0.018007 debye
polarizability: 147.6472848|-6.2007101|97.2413091|2.2005707|9.5642804|119.6496652 unknown
InChI: InChI=1S/C12H16/c1-10(2)12(8-9-12)11-6-4-3-5-7-11/h3-7,10H,8-9H2,1-2H3
charge 0 multiplicity 1
28 atoms
C  1.163481 -0.444242 0.159147
C  1.736085 -1.311327 1.292401
C  1.729158 -1.838565 -0.155419
C  2.031346 0.764144 -0.283938
C  -0.337938 -0.25686 0.098363
C  1.807326 1.130599 -1.770368
C  1.82677 1.996622 0.628501
C  -1.052463 0.264199 1.208771
C  -1.064015 -0.574973 -1.079126
C  -2.449238 0.467042 1.144668
C  -2.460863 -0.374429 -1.149148
C  -3.159424 0.150141 -0.036776
H  1.03941 -1.773741 1.998367
H  2.698335 -1.019819 1.727188
H  2.686968 -1.898629 -0.683542
H  1.0282 -2.644843 -0.392192
H  3.088157 0.436867 -0.174141
H  2.494533 1.94021 -2.079491
H  1.984284 0.260313 -2.429482
H  0.773372 1.482602 -1.940217
H  0.793156 2.38044 0.550314
H  2.512987 2.813911 0.338111
H  2.019452 1.747192 1.688548
H  -0.506114 0.500885 2.129549
H  -0.526382 -0.991473 -1.93931
H  -2.983341 0.867006 2.014317
H  -3.003929 -0.630259 -2.066303
H  -4.243515 0.302887 -0.087295
