program: Gaussian 09
title: 000143960
version: EM64L-G09RevD.01
frameworkgroup: C1[X(C10H12)]
method: RPBEPBE
basis: SDD
operation: Freq
keyword: #p
keyword: freq=noraman
keyword: PBEPBE/SDD
title: #p freq=noraman PBEPBE/SDD
converged: NO NO NO NO
title: Mulliken charges:
elementType: C C C C C C C C C C H H H H H H H H H H H H
charge: 0.333316 0.333312 0.515905 0.515908 -0.628153 -0.628146 -0.830110 -0.830108 -0.760275 -0.760274 0.228328 0.228327 0.229950 0.231377 0.229950 0.229950 0.231376 0.229952 0.225181 0.224527 0.225184 0.224526
chargesum: 0.00000
title: Mulliken charges with hydrogens summed into heavy atoms:
elementType: C C C C C C C C C C
charge: 0.333316 0.333312 0.515905 0.515908 -0.399826 -0.399820 -0.138833 -0.138830 -0.310567 -0.310565
polarizability: 1.81903491e+02 4.46022274e+01 1.32104602e+02 3.72752070e-03 -6.23148318e-04 5.40609461e+01
1716.lowfreq: -7.2770 -0.0007 -0.0005 -0.0004 11.4988 14.5118 85.5250 156.2196 197.7330
frequency: 85.5250 156.2196 197.7234 214.5147 226.8658 293.6897 312.1581 341.3139 358.4628 409.4681 413.2562 500.0065 519.7239 609.8811 655.0695 678.6504 687.4430 696.2136 762.2730 807.7282 889.4553 893.2154 929.6431 933.4109 952.2287 976.5294 1027.3161 1028.0115 1049.2337 1049.5494 1125.2275 1183.6330 1276.0114 1277.3807 1373.5243 1392.5555 1396.3367 1411.9169 1432.1700 1438.6882 1465.6825 1465.7679 1476.4427 1484.9170 1563.9014 1602.7397 1608.4257 1659.7520 2971.6675 2971.7344 3048.7868 3048.8345 3081.7712 3081.8379 3104.0937 3104.5477 3110.7483 3113.8511 3206.2832 3206.5315
redmass: 3.1842 2.3592 1.3065 1.1460 1.8974 2.5546 2.5805 2.5927 3.3310 2.2524 4.9079 3.4899 3.1402 2.2638 1.0533 3.9085 1.2806 5.9162 2.8651 2.6212 1.2956 1.3093 1.5137 1.5628 1.7374 1.3723 1.4903 1.6400 1.5889 1.5435 3.6509 2.4818 2.0386 1.2867 2.1747 1.2643 1.4196 1.5119 3.9766 1.2792 1.0467 1.0464 1.1360 1.1159 2.6927 5.7703 4.6894 6.9234 1.0368 1.0368 1.0972 1.0971 1.0988 1.0987 1.0618 1.0618 1.0906 1.0904 1.1134 1.1133
irintensity: 0.1962 5.7037 0.0000 0.0118 0.0000 0.5438 0.0000 0.7327 0.0000 9.6184 0.0000 0.0000 0.0000 4.3082 0.0000 2.0673 0.0984 0.0000 0.0000 2.3300 0.0000 11.3733 0.0000 174.8666 0.2409 0.0000 8.7257 0.0001 0.0004 15.9162 0.0000 5.9276 4.2402 0.0000 3.0179 0.0000 36.0739 0.0000 0.0000 20.3788 0.1019 27.7727 0.0000 5.8989 0.0000 14.7965 42.8752 0.0000 0.7785 63.0874 9.9563 33.1867 1.7995 30.5363 5.3406 0.0008 41.1477 0.0008 0.0003 29.2814
temp: 298.150 k
press: 1.00000 atm
elementType: 6 6 6 6 6 6 6 6 6 6 1 1 1 1 1 1 1 1 1 1 1 1
symmnumber: 1
zpe: 486524.5 jmol-1
zpe.correction: 0.185307 hartree
zpe.thermalcorrener: 0.195114 hartree
zpe.thermalcorrenthalpy: 0.196058 hartree
zpe.thermalcorrgfe: 0.151186 hartree
zpe.sumelectzpe: -387.495002 hartree
zpe.sumelectthermal: -387.485196 hartree
zpe.sumelectthermalent: -387.484251 hartree
zpe.sumelectthermalfe: -387.529123 hartree
dipole: 0.0000 0.0000 0.0000
dipole: 0.0000
quadrupole: -53.9324 -55.3342 -65.8746
quadrupole: -1.5989 0.0005 -0.0003
quadrupole: 4.4480 3.0462 -7.4942 -1.5989 0.0005 -0.0003
hfenergy: -387.6803091 hartree
pointgroup: C01 [X(C10H12)]
dipole: 0.0000015 -0.0000054 -0.0000001 debye
dipolederiv: 0.2547196 0.0863232 0.0000066 0.0961593 0.0618893 0.0000018 0.0000143 -0.0000049 -0.0472095 0.2547203 0.0863236 0.0000316 0.0961564 0.0618971 0.000014 0.0000038 0.000035 -0.0472114 0.1470334 -0.0673329 0.0000121 -0.0510262 0.1288682 -0.000001 -0.0000089 0.0000131 0.0746328 0.1470337 -0.0673333 -0.0000141 -0.0510177 0.128859 0.0000021 0.000026 -0.000018 0.0746335 -0.0851484 -0.0654423 -0.0000007 -0.0487922 0.0671757 -0.0000003 -0.000013 0.0000067 -0.181931 -0.0851568 -0.0654456 0.0000009 -0.0487933 0.0671829 0.0000069 0.0000192 -0.0000076 -0.1819278 -0.0990054 -0.1103848 -0.0000082 -0.0687086 0.0169632 -0.000005 -0.0000086 -0.0000044 0.0767753 -0.0990116 -0.1103797 -0.000028 -0.0687065 0.0169702 -0.000007 -0.0000216 -0.0000133 0.0767724 -0.2929781 0.2275329 0.0000155 0.1678181 -0.0765831 0.0000003 0.0000151 0.0000021 -0.4508497 -0.2929839 0.2275337 0. 0.1678127 -0.0765797 0.0000236 -0.0000064 0.0000235 -0.450851 0.0445843 -0.0118565 -0.0000026 -0.0599418 -0.123651 -0.0000077 -0.0000021 -0.0000057 0.139433 0.0445856 -0.0118504 -0.000007 -0.0599396 -0.1236551 -0.0000114 -0.0000073 -0.0000096 0.1394326 -0.0221301 -0.0031333 -0.0840839 0.0590896 0.0585227 0.0790031 -0.1109419 0.0338848 -0.0447288 0.0836612 0.0653718 -0.000001 -0.0692322 -0.1409431 -0.0000038 -0.0000012 0.0000013 0.1076068 -0.0221468 -0.0031312 0.0840882 0.0590898 0.0585252 -0.0789969 0.1109453 -0.0338838 -0.044719 -0.0221524 -0.0031354 0.0840864 0.0590845 0.0585378 -0.0789838 0.1109478 -0.0338782 -0.0447159 0.0836604 0.0653626 0.0000048 -0.0692401 -0.1409535 -0.0000279 -0.0000064 -0.0000166 0.1076074 -0.0221144 -0.0031259 -0.0840723 0.0591006 0.0585123 0.0790164 -0.1109239 0.0338976 -0.044727 -0.0750002 -0.057061 -0.0000156 -0.0718684 0.0576911 -0.0000034 -0.0000152 -0.0000021 0.1806077 0.0664129 -0.0608856 -0.0000077 -0.0125891 -0.1084612 0.0000023 -0.0000106 -0.0000003 0.1903802 -0.0749948 -0.0570584 -0.0000021 -0.0718655 0.0576944 -0.0000056 -0.0000032 -0.0000057 0.1806092 0.0664116 -0.0608915 -0.0000029 -0.0125898 -0.1084624 -0.0000167 -0.0000013 -0.000014 0.19038 unknown
polarizability: 183.725102|-43.5353445|130.2829908|0.0037138|0.0007|54.0609461 unknown
InChI: InChI=1S/C10H12/c1-7-5-9(3)10(4)6-8(7)2/h5-6H,1,4H2,2-3H3
charge 0 multiplicity 1
22 atoms
C  1.307843 0.646783 -0.000108
C  -1.307852 -0.646704 -0.000274
C  1.195667 -0.829849 -0.000138
C  -1.195674 0.829945 -0.000184
C  0.158399 1.401847 -0.000129
C  -0.158408 -1.401754 -0.000233
C  2.677422 1.296209 -0.000049
C  -2.677445 -1.296096 -0.000402
C  2.296784 -1.661429 -0.000065
C  -2.296792 1.661526 -0.000132
H  0.229387 2.497522 -0.000102
H  -0.22938 -2.497433 -0.000262
H  3.264378 1.000145 0.890351
H  2.593553 2.396626 -0.000054
H  3.264452 1.000166 -0.89041
H  -3.264495 -1.000133 0.889969
H  -2.593608 -2.39652 -0.000494
H  -3.264339 -0.999947 -0.890809
H  3.322857 -1.281226 -0.000005
H  2.183129 -2.75173 -0.000055
H  -3.322866 1.281326 -0.000141
H  -2.183112 2.751826 -0.000073
