program: Gaussian 09
title: 000143954
version: EM64L-G09RevD.01
frameworkgroup: C1[X(C10H22O)]
method: RPBEPBE
basis: SDD
operation: Freq
keyword: #pfreq=noraman
keyword: PBEPBE/SDD
title: #p freq=noraman PBEPBE/SDD
converged: YES YES NO NO
title: Mulliken charges:
elementType: O C C C C C C C C C C H H H H H H H H H H H H H H H H H H H H H H
charge: -0.459403 -0.006669 -0.098428 -0.417732 -0.405638 -0.415820 -0.352729 -0.358339 -0.719825 -0.705404 -0.697926 0.162520 0.191150 0.196115 0.223188 0.231034 0.201457 0.202422 0.201189 0.171221 0.231813 0.187668 0.197855 0.206517 0.219355 0.209697 0.209723 0.214123 0.218105 0.328459 0.213037 0.208052 0.213216
chargesum: 0.00000
title: Mulliken charges with hydrogens summed into heavy atoms:
elementType: O C C C C C C C C C C
charge: -0.130944 0.155851 0.092722 0.001570 0.026854 -0.012210 0.050305 0.027183 -0.084256 -0.063454 -0.063622
polarizability: 1.29884433e+02 -1.03340901e+00 1.08013686e+02 1.91816275e-01 -2.03818248e-02 1.00084319e+02
1716.lowfreq: -21.6498 -8.8567 -0.0007 -0.0004 -0.0002 11.0688 20.8146 45.6189 64.3495
frequency: -12.8749 45.0077 64.2966 75.1615 99.1920 119.8554 129.5773 176.7144 190.3386 205.9344 225.1055 228.7551 264.2502 289.0088 303.2147 312.2741 403.6312 427.4664 453.5302 491.1793 609.3032 728.6680 742.5991 767.8729 780.6257 830.4536 870.3911 891.9935 909.8396 951.7687 985.2879 992.7118 1010.4697 1038.1542 1048.9704 1055.3172 1072.1249 1087.3364 1105.4937 1123.3196 1139.4870 1167.4007 1203.1958 1236.1070 1242.0498 1251.0595 1265.7446 1284.6396 1289.0645 1296.8608 1307.3166 1318.8757 1327.7404 1346.9337 1355.0363 1358.2419 1386.6120 1387.8982 1388.9597 1404.6415 1448.3013 1467.4150 1468.4473 1474.2762 1475.0773 1475.4494 1477.2094 1478.2737 1483.6915 1487.1089 1487.7432 2900.1596 2940.7169 2957.4253 2963.6389 2971.1105 2971.5323 2972.0014 2973.2713 2976.3006 2981.1641 3005.6216 3022.8832 3029.7731 3030.8919 3054.7908 3066.1799 3067.0165 3068.2353 3069.6249 3070.5822 3073.0429 3552.8723
redmass: 2.3857 1.9908 2.6233 1.8875 2.2563 2.4042 2.0503 1.7234 1.4864 2.4039 1.6567 1.2769 2.0006 2.2991 2.1920 1.3732 2.7580 2.6890 2.8252 2.7778 2.8770 1.1099 1.6549 1.2689 1.2667 1.5699 1.7653 1.8267 1.7092 1.4396 2.0558 2.0938 1.4471 2.9533 2.4843 2.3723 2.0034 1.9108 1.4398 2.2968 2.0910 2.2100 1.4994 1.3706 1.2724 1.2769 1.2373 1.1744 1.1193 1.1494 1.2012 1.3056 1.3605 1.5107 1.4911 1.5684 1.2160 1.2110 1.2107 1.5949 1.0836 1.0651 1.0605 1.0575 1.0482 1.0471 1.0652 1.0586 1.0575 1.0697 1.0769 1.0817 1.0832 1.0616 1.0630 1.0371 1.0363 1.0600 1.0377 1.0594 1.0607 1.0966 1.0998 1.0994 1.0961 1.1019 1.0998 1.0998 1.1002 1.0991 1.0998 1.0995 1.0658
irintensity: 0.1122 0.2608 0.1033 0.2711 0.1817 0.4814 0.5571 0.8290 0.8826 2.3693 0.1929 0.3242 2.1783 15.2623 36.3519 98.3451 1.2925 4.4684 6.4879 6.1055 2.1049 5.4382 12.1528 1.6987 11.2535 1.4185 17.5079 5.0189 5.1208 2.4953 41.4444 12.6114 5.4808 12.1629 2.6111 1.4985 6.3708 5.8189 15.8281 11.3946 3.3182 0.7289 5.8802 8.9580 5.4895 17.2025 4.4047 4.0584 4.8237 5.4931 0.7409 2.4229 2.2844 0.9838 0.2661 1.0535 10.6573 11.5936 10.6644 20.6068 2.2971 0.3741 1.6044 2.3046 5.4838 12.6573 2.8079 14.7680 10.3460 5.2809 31.2277 37.6680 46.1350 5.7557 55.5366 83.0335 12.6212 9.2709 45.7204 1.3072 72.2810 15.8455 20.1178 7.3234 5.4091 23.7550 16.6101 88.6564 91.6905 48.2502 83.8498 66.8484 4.9544
temp: 298.150 k
press: 1.00000 atm
elementType: 8 6 6 6 6 6 6 6 6 6 6 1 1 1 1 1 1 1 1 1 1 1 1 1 1 1 1 1 1 1 1 1 1
symmnumber: 1
zpe: 789576.5 jmol-1
zpe.correction: 0.300734 hartree
zpe.thermalcorrener: 0.315091 hartree
zpe.thermalcorrenthalpy: 0.316035 hartree
zpe.thermalcorrgfe: 0.259651 hartree
zpe.sumelectzpe: -468.534459 hartree
zpe.sumelectthermal: -468.520101 hartree
zpe.sumelectthermalent: -468.519157 hartree
zpe.sumelectthermalfe: -468.575542 hartree
dipole: 1.3861 1.1347 -0.0339
dipole: 1.7916
quadrupole: -72.6341 -73.6281 -70.0445
quadrupole: -0.6722 3.2524 0.9438
quadrupole: -0.5319 -1.5259 2.0578 -0.6722 3.2524 0.9438
hfenergy: -468.8351925 hartree
pointgroup: C01 [X(C10H22O1)]
dipole: 0.5527314 -0.4369801 0.019628 debye
polarizability: 129.8441545|1.4002985|108.0533283|-0.129941|-0.1085131|100.0849539 unknown
InChI: InChI=1S/C10H22O/c1-4-7-8-10(11)9(5-2)6-3/h9-11H,4-8H2,1-3H3
charge 0 multiplicity 1
33 atoms
O  -0.007002 1.019321 -1.739052
C  1.678085 -0.003678 -0.207852
C  0.216495 -0.061328 -0.745071
C  -0.881492 0.125363 0.315013
C  1.96007 1.321114 0.553965
C  2.050525 -1.250456 0.643023
C  -2.303646 -0.108989 -0.240814
C  -3.407289 0.122905 0.815475
C  3.460554 1.67298 0.65354
C  2.052806 -2.592622 -0.124358
C  -4.828567 -0.112118 0.259083
H  2.340148 -0.018208 -1.10749
H  0.065068 -1.041218 -1.250645
H  -0.694068 -0.570736 1.157339
H  -0.809705 1.153659 0.718927
H  1.428195 2.142227 0.035244
H  1.528141 1.254624 1.573057
H  3.060525 -1.088504 1.067552
H  1.363475 -1.319567 1.510648
H  -2.382431 -1.147091 -0.628768
H  -2.461601 0.563785 -1.104842
H  -3.23359 -0.546492 1.683572
H  -3.327705 1.159681 1.20184
H  3.907611 1.780914 -0.353501
H  3.610096 2.628033 1.190141
H  4.034852 0.896758 1.192881
H  2.710425 -2.538963 -1.013117
H  1.042782 -2.877005 -0.47115
H  2.423847 -3.412168 0.518246
H  0.679371 0.936765 -2.449531
H  -5.03723 0.567647 -0.588452
H  -4.94308 -1.149553 -0.108798
H  -5.601866 0.060622 1.030392
