program: Gaussian 09
title: 000143950
version: EM64L-G09RevD.01
frameworkgroup: C1[X(C7H10O2)]
method: RPBEPBE
basis: SDD
operation: Freq
keyword: #pfreq=noraman
keyword: PBEPBE/SDD
title: #p freq=noraman PBEPBE/SDD
converged: NO YES NO NO
title: Mulliken charges:
elementType: O O C C C C C C C H H H H H H H H H H
charge: -0.263645 -0.245389 -0.502779 -0.480479 -0.228675 0.262268 -0.671400 0.204587 -0.504502 0.259471 0.259590 0.251168 0.252355 0.229127 0.229311 0.212583 0.230608 0.230665 0.275135
chargesum: 0.00000
title: Mulliken charges with hydrogens summed into heavy atoms:
elementType: O O C C C C C C C
charge: -0.263645 -0.245389 0.016282 0.023045 0.229762 0.262268 0.002456 0.204587 -0.229368
polarizability: 1.14251950e+02 -8.82456559e+00 7.21673012e+01 -2.06860162e-01 8.11050720e-02 5.22305516e+01
1716.lowfreq: -36.3659 -5.5865 0.0005 0.0005 0.0008 4.3876 31.4880 40.9041 57.9604
frequency: 14.2517 38.5899 57.8881 80.2913 147.9363 171.5147 246.5818 248.2411 323.5217 327.0656 392.1701 492.6172 550.6366 635.1465 645.6502 679.8218 770.1594 795.6685 807.5396 912.5185 954.3107 1014.6484 1020.5585 1063.2791 1112.7333 1135.3681 1137.8858 1160.0406 1247.1986 1272.2707 1276.0189 1347.7919 1364.8356 1397.7658 1443.2453 1458.4786 1463.0076 1473.5743 1486.1732 1636.6112 2144.6506 2996.2803 3001.1787 3009.7252 3015.2975 3046.9055 3068.2575 3074.0927 3092.9708 3108.7834 3428.0008
redmass: 2.1317 3.6094 2.6007 4.1290 2.1033 4.0428 5.2887 1.2798 3.0649 4.6796 4.3208 5.0103 2.5634 1.2301 1.2251 6.4618 1.3902 1.0985 3.7110 5.9523 4.0964 2.0003 2.3274 3.5823 2.2812 1.4677 3.0960 1.1638 1.1351 1.0991 1.4806 1.3914 1.6419 1.2688 1.0811 1.0855 1.0406 1.0582 1.0700 9.6370 6.0441 1.0358 1.0602 1.0581 1.0604 1.0997 1.1067 1.1010 1.0985 1.1026 1.1589
irintensity: 0.0687 0.6583 0.0004 0.6897 7.6707 1.4823 8.5330 1.2817 10.0384 10.6499 3.1673 9.4263 0.9883 77.8634 75.7226 4.5077 10.8194 3.5095 3.3996 30.5479 12.0573 1.0667 52.8913 31.7057 13.0488 6.0166 334.1339 0.9637 0.0083 0.4971 82.2654 16.0156 26.6346 18.2701 22.6214 20.6845 12.2284 5.2545 13.8726 177.4657 9.6376 20.5664 6.0718 18.0778 13.4958 1.6866 8.0791 13.9616 29.5561 44.6013 66.7084
temp: 298.150 k
press: 1.00000 atm
elementType: 8 8 6 6 6 6 6 6 6 1 1 1 1 1 1 1 1 1 1
symmnumber: 1
zpe: 399491.4 jmol-1
zpe.correction: 0.152158 hartree
zpe.thermalcorrener: 0.163120 hartree
zpe.thermalcorrenthalpy: 0.164064 hartree
zpe.thermalcorrgfe: 0.113126 hartree
zpe.sumelectzpe: -422.431078 hartree
zpe.sumelectthermal: -422.420117 hartree
zpe.sumelectthermalent: -422.419173 hartree
zpe.sumelectthermalfe: -422.470111 hartree
dipole: -1.6856 -1.4174 0.0032
dipole: 2.2024
quadrupole: -45.0280 -58.8963 -52.9363
quadrupole: -1.5844 -0.0470 0.0726
quadrupole: 7.2589 -6.6095 -0.6494 -1.5844 -0.0470 0.0726
hfenergy: -422.5832367 hartree
pointgroup: C01 [X(C7H10O2)]
dipole: 0.6531017 -0.5693728 0.0067889 debye
dipolederiv: -1.7002071 0.337529 0.003203 0.4118636 -0.630273 0.0018964 0.0023813 0.0027347 -0.2834983 -0.7152089 -0.1086561 0.0035371 0.2862608 -0.9483495 0.0078829 -0.0004837 0.0097879 -0.2995042 -0.2308822 -0.1071619 0.0050014 -0.314743 -0.140959 0.0088245 0.0155772 0.0091423 0.1373412 0.1095684 0.0152331 -0.0001016 -0.0221656 0.0887688 0.0015002 -0.0015866 -0.0000962 0.1503201 0.9120971 -0.0761516 -0.0019735 0.0994573 0.2343127 0.0009719 -0.0023705 0.0012711 0.3532876 1.7010552 -0.1177779 -0.0096076 -0.5667857 1.304217 -0.0129781 -0.0082311 -0.0154078 0.1828613 -0.0993476 0.0855972 -0.0010461 0.0673267 -0.0101736 0.0016664 -0.0009689 0.0015168 0.0604607 0.1909691 0.160254 -0.0062416 0.2437541 0.0065018 -0.0026682 -0.0089201 -0.002202 -0.0669381 -0.5672519 -0.0411667 0.0015864 -0.1307462 -0.3658229 0.0006209 0.0046156 0.0003278 -0.3481241 0.0587828 0.0033334 -0.0097736 0.0408562 0.0518398 0.0775676 -0.0159712 0.0925721 -0.0094457 0.0591063 0.0047603 0.0096939 0.0436632 0.0399586 -0.0814797 0.0114958 -0.0965484 0.0028069 0.0402664 -0.0410442 0.0164223 -0.0013276 0.0368761 0.0851708 0.0109735 0.0952004 -0.0152139 0.0434732 -0.0425767 -0.0135821 -0.0012337 0.0251582 -0.0869333 -0.0100885 -0.096218 -0.0003189 -0.048361 0.0302339 -0.0188554 -0.0565033 0.0028562 0.0922816 0.0227799 0.1015581 -0.0650367 -0.0470522 0.0303823 0.0184885 -0.0578584 -0.0044107 -0.0936258 -0.0208926 -0.1033292 -0.0568592 -0.1557828 -0.0574118 0.0019462 -0.0780465 0.0480422 0.0014315 0.0022421 0.0014163 0.1161888 0.1120871 -0.0216006 0.0406237 0.0316108 0.011433 0.0987765 0.0115624 0.1154076 -0.067142 0.1117422 -0.0236915 -0.0406031 0.030723 0.0028607 -0.1017662 -0.0135061 -0.1181229 -0.058288 0.2249459 -0.0300843 0.0012821 -0.0261055 0.2471635 0.0008601 0.0013913 0.0009893 0.2671027 unknown
polarizability: 114.55125|8.0571256|71.8546959|-0.5978649|-0.4724577|52.2438571 unknown
InChI: InChI=1S/C7H10O2/c1-3-5-6-7(8)9-4-2/h1H,4-6H2,2H3
charge 0 multiplicity 1
19 atoms
O  1.675058 -0.490134 -0.006547
O  0.727622 1.640304 -0.027994
C  -0.717533 -0.371906 0.010856
C  -1.936586 0.583027 -0.021864
C  3.037769 0.131497 -0.021569
C  0.595724 0.393787 -0.010669
C  4.043507 -1.014451 -0.001244
C  -3.214667 -0.14883 0.006777
C  -4.283865 -0.763118 0.03144
H  -0.743409 -1.007069 0.915557
H  -0.739964 -1.067384 -0.847904
H  -1.884168 1.215133 -0.927845
H  -1.880357 1.278983 0.835712
H  3.122465 0.757019 -0.928616
H  3.12637 0.792192 0.859836
H  5.071912 -0.609539 -0.011509
H  3.921509 -1.629625 0.906339
H  3.917685 -1.665216 -0.883144
H  -5.217472 -1.294569 0.054287
