program: Gaussian 09
title: 000143900
version: EM64L-G09RevD.01
frameworkgroup: C1[X(C8H10BrFSi)]
method: RPBEPBE
basis: SDD
operation: Freq
keyword: #p
keyword: freq=noraman
keyword: PBEPBE/SDD
title: #p freq=noraman PBEPBE/SDD
converged: NO YES NO NO
title: Mulliken charges:
elementType: Br Si F C C C C C C C C H H H H H H H H H H
charge: 0.009997 1.400886 -0.461758 -0.259513 -1.043875 -1.042359 -0.284580 -0.271197 -0.187540 -0.183865 -0.200885 0.263461 0.254622 0.240723 0.263094 0.241130 0.254344 0.229510 0.270392 0.253101 0.254313
chargesum: 0.00000
title: Mulliken charges with hydrogens summed into heavy atoms:
elementType: Br Si F C C C C C C C C
charge: 0.009997 1.400886 -0.461758 -0.259513 -0.285070 -0.283791 -0.055070 -0.000805 0.065561 0.070448 -0.200885
polarizability: 1.87829778e+02 -5.20712857e+00 1.07150398e+02 2.74139543e-01 -1.25804189e-01 7.41630669e+01
1716.lowfreq: -10.8864 -1.6352 -0.0008 0.0008 0.0011 5.7408 18.4170 52.4373 83.3078
frequency: 17.9161 52.4321 83.2753 108.0872 129.8360 134.6351 166.1578 186.1819 218.5507 223.3251 280.1678 312.5016 327.3410 394.4813 436.2958 497.2173 619.5821 627.9558 708.9960 713.8189 719.5743 728.4145 805.0914 813.0259 839.1492 848.8059 896.3384 914.2629 953.6721 983.2772 994.2759 1056.6267 1105.1393 1106.5719 1194.3756 1293.9985 1311.5382 1319.3394 1340.6436 1375.0831 1433.4065 1441.1724 1442.4142 1451.4267 1461.3476 1563.1888 1576.1648 2989.8181 2990.9492 3089.6437 3091.6514 3102.5296 3103.2393 3112.1074 3142.6575 3166.0263 3169.7991
redmass: 3.6568 4.8931 3.8742 1.0363 1.1674 3.4984 3.9804 3.9842 4.8146 5.0976 5.5190 5.0900 5.1439 2.8252 6.1932 3.0995 7.0951 5.2797 5.9173 3.8457 2.2992 5.2287 1.2532 1.4378 1.4965 1.4993 1.6104 1.5129 1.3485 1.3559 5.4858 3.5954 2.2619 1.6604 1.1256 1.2573 1.2034 1.1935 3.9807 3.7064 1.0503 1.0540 1.0462 1.0623 2.0785 7.1538 5.9267 1.0352 1.0350 1.0976 1.0973 1.0986 1.0986 1.0899 1.0892 1.0949 1.0966
irintensity: 0.5549 0.0598 2.5942 0.0103 0.0291 0.0148 0.4027 1.3303 0.5339 7.5653 28.7540 8.0002 8.9063 0.0318 3.1805 42.7235 1.1006 8.3142 51.3539 1.5423 9.7052 38.5093 9.6647 102.7544 47.4529 4.7422 205.4344 129.2951 0.6168 0.0414 34.1445 50.0806 15.6981 10.4824 0.5081 1.1617 53.0716 30.5953 8.4286 10.0465 2.8801 0.9818 7.0518 19.0643 44.4778 2.8085 62.2796 5.3603 7.5636 1.0298 20.9007 7.3264 12.7255 14.0365 0.3613 7.8081 2.0076
temp: 298.150 k
press: 1.00000 atm
elementType: 35 14 9 6 6 6 6 6 6 6 6 1 1 1 1 1 1 1 1 1 1
symmnumber: 1
zpe: 407720.2 jmol-1
zpe.correction: 0.155292 hartree
zpe.thermalcorrener: 0.168418 hartree
zpe.thermalcorrenthalpy: 0.169362 hartree
zpe.thermalcorrgfe: 0.113233 hartree
zpe.sumelectzpe: -712.796648 hartree
zpe.sumelectthermal: -712.783523 hartree
zpe.sumelectthermalent: -712.782579 hartree
zpe.sumelectthermalfe: -712.838707 hartree
dipole: 1.5252 -2.5750 0.1272
dipole: 2.9955
quadrupole: -84.1946 -78.6807 -83.4705
quadrupole: -9.7142 0.4750 0.1458
quadrupole: -2.0794 3.4346 -1.3552 -9.7142 0.4750 0.1458
hfenergy: -712.9519408 hartree
pointgroup: C01 [X(C8H10Br1F1Si1)]
dipole: -0.5898962 1.0190914 0.0493006 debye
dipolederiv: -0.8202176 0.0185391 0.0004451 0.0066661 -0.0707958 -0.0003714 -0.0001709 -0.0003172 -0.0432993 2.1619838 -0.0512475 -0.0021442 -0.0469433 1.2378619 -0.0101078 -0.0012982 -0.0092207 1.5201032 -0.7031673 -0.0749812 -0.0033056 -0.0959524 -0.7123465 -0.0113225 -0.0042263 -0.0106125 -0.5288202 -0.4557678 0.0107002 -0.000532 0.0496455 -0.287148 0.0053593 -0.0012631 0.0058194 -0.4035715 -0.5233321 0.0742731 -0.0621733 0.0388782 -0.270421 0.0244268 -0.0269379 0.0797452 -0.4667396 -0.5259069 0.0671989 0.069325 0.0298323 -0.2602952 -0.0037396 0.0286972 -0.0602135 -0.4738929 0.0597976 -0.0998379 0.0003164 0.1682667 0.0858056 0.0011271 0.0016609 0.0010053 -0.1174008 0.0099767 0.1096416 0.000558 -0.188792 0.0818351 0.0028541 0.0013382 0.0035111 -0.1008945 -0.4695267 0.1421934 0.0015254 0.0686066 -0.0021955 0.0012164 0.0004952 0.001198 -0.08433 -0.4686683 -0.14415 -0.0018955 -0.0398103 0.014173 0.0018813 -0.0006442 0.0010945 -0.0798738 1.4214799 -0.0212148 0.0001198 -0.0248629 0.0683166 0.0022094 0.0004571 0.0022701 -0.116951 0.1214449 0.0258463 0.0477799 0.0021529 0.0858428 -0.0458495 0.0911212 -0.069927 -0.0769583 -0.1569548 -0.0051748 -0.0168027 0.03739 0.1150226 0.0046163 -0.0861377 0.0117888 0.106957 0.1189336 -0.0575696 0.0093263 -0.0477125 -0.1010967 0.0118619 0.0177158 0.0071408 0.1145948 0.1209528 0.031487 -0.0446847 0.0117911 0.0721754 0.0620442 -0.0898438 0.0843798 -0.0637254 0.1188535 -0.0548728 -0.0139429 -0.0452193 -0.0966892 -0.0343395 -0.0233922 -0.0284086 0.1101942 -0.1582068 -0.0071818 0.0157918 0.0293111 0.1161946 -0.0039402 0.0917898 -0.0113291 0.1044339 0.0050992 0.1015227 0.0011574 0.0867159 -0.0558898 -0.0016843 0.0012911 -0.0014861 0.1341416 0.0662701 -0.0671771 -0.0008138 -0.0389669 0.0030147 -0.0017615 -0.0002106 -0.0018148 0.1394309 0.0376509 -0.070822 -0.000895 -0.0727828 -0.0116764 -0.0021077 -0.001083 -0.0021336 0.1633836 0.0393051 0.0728273 0.0008446 0.0717859 -0.0116883 -0.0023728 0.0006413 -0.0024899 0.163218 unknown
polarizability: 187.7173781|-6.0136619|107.2628865|-0.2888829|0.1019989|74.1629783 unknown
InChI: InChI=1S/C8H10BrFSi/c1-11(2,10)8-5-3-7(9)4-6-8/h3-6H,1-2H3
charge 0 multiplicity 1
21 atoms
Br 4.467046 -0.026894 0.002152
Si -2.231956 0.031415 0.001856
F  -2.642379 -1.653915 -0.079724
C  -0.329775 0.033286 0.00073
C  -2.963687 0.851729 -1.541066
C  -2.964638 0.691137 1.619814
C  0.415994 1.242759 0.015945
C  0.383722 -1.194893 -0.01485
C  1.830173 1.236597 0.01669
C  1.797723 -1.223748 -0.01468
C  2.501504 -0.003104 0.00158
H  -2.563575 0.383524 -2.45717
H  -4.063632 0.751187 -1.556815
H  -2.718765 1.929416 -1.574423
H  -2.565013 0.132518 2.484032
H  -2.719211 1.759656 1.762466
H  -4.064636 0.589641 1.624658
H  -0.092704 2.215518 0.026629
H  -0.169063 -2.140812 -0.029641
H  2.391809 2.175157 0.028305
H  2.333863 -2.177075 -0.027387
