program: Gaussian 09
title: 000143896
version: EM64L-G09RevD.01
frameworkgroup: C1[X(C11H19NOSi)]
method: RPBEPBE
basis: SDD
operation: Freq
keyword: #p
keyword: freq=noraman
keyword: PBEPBE/SDD
title: #p freq=noraman PBEPBE/SDD
converged: YES YES NO NO
title: Mulliken charges:
elementType: Si O N C C C C C C C C C C C H H H H H H H H H H H H H H H H H H H
charge: 1.406071 -0.597050 -0.154800 -0.250364 -1.038545 -1.038729 -0.314288 -0.302916 0.395804 -0.357464 -0.346771 -0.488048 -0.646647 -0.646404 0.252686 0.237305 0.229788 0.238221 0.252407 0.229586 0.212339 0.269638 0.232520 0.232758 0.228865 0.202992 0.202332 0.214510 0.232100 0.231803 0.213525 0.233610 0.233167
chargesum: 0.00000
title: Mulliken charges with hydrogens summed into heavy atoms:
elementType: Si O N C C C C C C C C C C C
charge: 1.406071 -0.597050 -0.154800 -0.250364 -0.318767 -0.318515 -0.101949 -0.033277 0.395804 -0.124943 -0.114013 0.146141 0.031766 0.033897
polarizability: 2.28321308e+02 4.25517017e+00 1.47494550e+02 -1.00677363e-01 8.97801445e-02 1.04282577e+02
1716.lowfreq: -5.4986 -0.0019 -0.0015 -0.0004 7.0536 8.4627 22.7465 44.5503 60.4796
frequency: 22.0462 44.1470 60.3973 68.3531 75.1826 98.6552 106.9448 121.5678 131.3863 134.2647 145.6116 178.5255 205.6458 212.1043 215.2828 232.7605 258.8401 305.8050 353.4921 356.3406 410.4039 447.7237 470.9440 525.2131 564.5127 621.0780 631.0711 683.7172 690.6707 726.8854 752.4236 787.6001 804.4049 816.1085 826.4522 882.1953 900.3289 935.7063 943.6921 976.2152 997.4211 1046.4485 1056.6453 1110.1459 1110.5479 1116.0393 1117.4114 1129.3877 1147.9878 1168.4414 1214.8277 1265.0981 1290.7653 1298.5319 1310.9318 1358.3763 1363.5748 1416.9786 1435.4453 1438.3040 1439.0230 1440.8098 1448.7202 1452.4576 1458.4437 1463.0344 1472.1834 1474.0160 1474.0817 1494.6206 1504.9081 1519.0737 1547.1622 1621.2784 2925.4862 2934.2733 2943.1412 2979.1270 2980.6838 2997.6923 3001.3162 3001.6078 3068.5337 3076.6958 3079.4808 3092.0380 3092.6590 3092.7284 3093.8821 3102.0324 3134.3895 3157.8687 3161.7817
redmass: 3.1854 3.1973 3.1900 3.6570 2.3892 2.3436 1.0394 1.0175 1.6765 1.8042 1.3775 2.6608 1.1489 2.1881 3.7262 3.5799 3.1687 3.8148 4.4127 4.0674 2.9135 3.2434 3.6083 2.4406 4.3387 4.5398 6.7648 4.7285 2.6769 2.7820 5.1432 1.2759 1.5353 1.4948 1.7062 1.6124 1.4758 1.3531 3.1562 1.3286 3.5402 6.3598 1.4873 1.3149 1.2416 3.3144 1.2583 1.5799 1.4261 1.6277 1.1389 2.9416 1.2073 1.2035 1.4284 3.0555 4.0236 2.4056 1.3340 1.0527 1.0999 1.0564 1.0607 1.0634 1.2120 1.0404 1.0517 1.0463 1.0525 1.0803 1.3283 1.7838 6.2417 5.9125 1.0330 1.0369 1.0394 1.0346 1.0343 1.0995 1.1023 1.1026 1.0981 1.0978 1.0972 1.0944 1.0966 1.0975 1.0933 1.0938 1.0879 1.0927 1.0942
irintensity: 0.1024 7.6786 0.5208 2.4660 0.0396 4.7860 0.1490 0.0065 1.7505 0.0977 0.6588 1.0334 0.5459 5.8428 1.9430 0.4151 6.7180 1.6523 18.5621 19.2447 0.0551 12.0117 2.8838 24.8490 5.1642 12.7913 2.0931 40.8655 19.7513 1.4585 0.6796 3.0883 73.8919 91.9912 2.5136 200.0953 117.2807 0.6599 11.7015 0.0494 2.9043 252.9014 28.4486 1.1442 0.0568 135.7688 0.1603 0.0200 24.3013 0.0301 22.1308 34.1759 51.0147 28.7407 21.0417 113.9082 10.2265 3.8306 0.7944 2.6096 3.1816 0.0325 5.6870 13.7338 14.9197 0.0712 13.1981 18.5582 8.1107 2.7770 1.5904 214.0989 10.0359 275.6104 123.9670 116.7204 90.0011 8.1559 19.4848 14.5825 54.8296 97.6251 46.9199 1.1582 44.2283 6.6722 5.1781 6.5742 40.6887 48.1822 1.6806 28.9751 15.8377
temp: 298.150 k
press: 1.00000 atm
elementType: 14 8 7 6 6 6 6 6 6 6 6 6 6 6 1 1 1 1 1 1 1 1 1 1 1 1 1 1 1 1 1 1 1
symmnumber: 1
zpe: 722803.1 jmol-1
zpe.correction: 0.275301 hartree
zpe.thermalcorrener: 0.293656 hartree
zpe.thermalcorrenthalpy: 0.294600 hartree
zpe.thermalcorrgfe: 0.227711 hartree
zpe.sumelectzpe: -848.867980 hartree
zpe.sumelectthermal: -848.849625 hartree
zpe.sumelectthermalent: -848.848681 hartree
zpe.sumelectthermalfe: -848.915570 hartree
dipole: 1.8346 -0.8037 0.0448
dipole: 2.0034
quadrupole: -66.0923 -88.0219 -98.1302
quadrupole: 1.1282 -0.0786 0.0717
quadrupole: 17.9891 -3.9404 -14.0487 1.1282 -0.0786 0.0717
hfenergy: -849.1432809 hartree
pointgroup: C01 [X(C11H19N1O1Si1)]
dipole: -0.7277501 0.3026934 0.0057504 debye
polarizability: 228.1227617|5.7997098|147.5718474|-0.7425968|-2.2790045|104.4038269 unknown
InChI: InChI=1S/C11H19NOSi/c1-12(2)10-6-8-11(9-7-10)14(4,5)13-3/h6-9H,1-5H3
charge 0 multiplicity 1
33 atoms
Si 2.558214 0.454403 -0.041834
O  3.113276 -1.207203 0.005603
N  -3.593716 -0.189478 0.014689
C  0.675815 0.267937 -0.029916
C  3.197911 1.302874 -1.63021
C  3.208756 1.391588 1.491583
C  -0.193036 1.391771 -0.083261
C  0.067593 -1.015253 0.036957
C  -2.201321 -0.040235 -0.001306
C  -1.594504 1.255087 -0.070074
C  -1.330428 -1.175808 0.051108
C  4.512892 -1.599252 0.026438
C  -4.460104 0.992345 -0.048072
C  -4.188036 -1.528566 0.090919
H  2.875393 0.737335 -2.522559
H  2.795738 2.32994 -1.715878
H  4.301929 1.372166 -1.640348
H  2.788324 2.413973 1.533403
H  2.910245 0.865465 2.415904
H  4.311228 1.481076 1.480195
H  0.221257 2.408473 -0.137044
H  0.712178 -1.900838 0.077745
H  -2.213924 2.155833 -0.112412
H  -1.743578 -2.187521 0.102703
H  4.543298 -2.702055 0.054049
H  5.039701 -1.209177 0.923122
H  5.054276 -1.254048 -0.879871
H  -5.515069 0.675717 -0.027852
H  -4.29807 1.57487 -0.97863
H  -4.293335 1.674104 0.811488
H  -5.286327 -1.442552 0.101623
H  -3.880058 -2.064965 1.012038
H  -3.904418 -2.158203 -0.777699
