program: Gaussian 09
title: 000143872
version: EM64L-G09RevD.01
frameworkgroup: C1[X(C8H15ClO2)]
method: RPBEPBE
basis: SDD
operation: Freq
keyword: #p
keyword: freq=noraman
keyword: PBEPBE/SDD
title: #p freq=noraman PBEPBE/SDD
converged: YES YES NO NO
title: Mulliken charges:
elementType: Cl O O C C C C C C C C H H H H H H H H H H H H H H H
charge: -0.051436 -0.253970 -0.224989 -0.036502 -0.410814 -0.296442 -0.707368 -0.710738 -0.465270 0.354057 -0.630590 0.208790 0.213970 0.219577 0.242873 0.244487 0.216082 0.209957 0.217545 0.211620 0.216769 0.215317 0.295735 0.241564 0.218768 0.261009
chargesum: 0.00000
title: Mulliken charges with hydrogens summed into heavy atoms:
elementType: Cl O O C C C C C C C C
charge: -0.051436 -0.253970 -0.224989 0.172288 0.022733 0.190917 -0.063784 -0.067032 -0.169535 0.354057 0.090751
polarizability: 1.24741493e+02 -1.62595593e+00 9.94615676e+01 -1.04972978e+00 4.96840758e-01 8.53780211e+01
1716.lowfreq: -15.1956 -6.0681 0.0006 0.0015 0.0026 7.7717 15.9997 29.2477 52.1781
frequency: 10.3133 29.2213 52.1158 79.8972 101.4893 125.3152 171.3133 218.5947 229.9748 236.7912 245.3963 261.7725 304.6020 305.4760 356.6437 367.1391 436.6392 541.8355 584.6975 651.7828 720.5775 775.6126 782.6174 847.2753 906.9962 912.0313 950.6978 965.9590 984.8222 991.7485 1021.8927 1069.1750 1103.7379 1133.0013 1140.7780 1148.4832 1193.4535 1208.9694 1222.4330 1279.6617 1285.7222 1324.1842 1332.5662 1340.6012 1378.9285 1380.0637 1397.3074 1397.7833 1460.5071 1463.9355 1465.4940 1466.3454 1477.5146 1481.9432 1486.1326 1490.4279 1637.4616 2968.5479 2969.8732 2973.4709 2992.5087 2994.3540 3014.7174 3043.0262 3061.8032 3068.1016 3070.2731 3073.4693 3086.6246 3089.6861 3105.2984 3129.0990
redmass: 3.2001 5.1008 5.4926 3.9724 1.9875 4.6494 3.7463 1.1314 1.9527 1.1622 1.5316 2.4407 5.2405 3.4984 2.0861 2.3110 3.9443 3.2019 4.1743 4.5566 6.1375 1.1842 3.0193 4.3507 5.5095 1.1970 1.2785 1.9922 1.7675 1.5592 1.8956 1.5033 4.1638 2.2289 2.0274 1.7736 1.9168 1.2125 1.2570 1.1158 1.5508 1.5579 1.4685 1.4577 1.2129 1.4841 1.2235 1.2230 1.0411 1.0855 1.0537 1.0451 1.0542 1.0814 1.0509 1.0561 10.0174 1.0797 1.0357 1.0366 1.0639 1.0389 1.0567 1.1023 1.1000 1.1001 1.0989 1.0989 1.1080 1.0942 1.0905 1.0998
irintensity: 0.4182 0.6812 1.2943 0.9536 0.4943 1.3468 1.1999 0.5081 2.2715 0.7939 2.0526 0.9361 18.6803 0.9294 0.1303 0.9353 10.7277 14.6210 15.5492 8.2723 1.8834 2.1698 1.3071 9.6373 37.6726 2.4562 0.1164 2.2235 0.0752 25.1638 7.6240 37.8235 186.4350 175.5449 21.7799 7.4496 6.6082 0.2569 25.3833 0.5151 8.7809 44.0726 1.9114 6.1097 21.7976 0.4881 14.3244 24.9978 13.1804 9.5106 11.8894 1.3526 3.1494 10.4056 13.2967 18.5956 171.5570 15.4120 37.8846 18.8645 26.9180 11.6455 17.7762 6.8181 19.8331 22.6022 70.3871 84.0317 37.1804 11.2744 6.9185 11.3339
temp: 298.150 k
press: 1.00000 atm
elementType: 17 8 8 6 6 6 6 6 6 6 6 1 1 1 1 1 1 1 1 1 1 1 1 1 1 1
symmnumber: 1
zpe: 571687.6 jmol-1
zpe.correction: 0.217744 hartree
zpe.thermalcorrener: 0.231758 hartree
zpe.thermalcorrenthalpy: 0.232702 hartree
zpe.thermalcorrgfe: 0.174152 hartree
zpe.sumelectzpe: -923.462345 hartree
zpe.sumelectthermal: -923.448331 hartree
zpe.sumelectthermalent: -923.447387 hartree
zpe.sumelectthermalfe: -923.505937 hartree
dipole: 2.0995 -1.0500 -2.0473
dipole: 3.1148
quadrupole: -68.8127 -76.2708 -77.6154
quadrupole: 5.5950 3.8800 3.4943
quadrupole: 5.4203 -2.0378 -3.3825 5.5950 3.8800 3.4943
hfenergy: -923.680089 hartree
pointgroup: C01 [X(C8H15Cl1O2)]
dipole: 0.8812212 -0.8491437 0.0645911 debye
dipolederiv: -0.3137941 0.0235391 -0.107192 0.0301502 -0.3133933 0.1978172 -0.1048791 0.1605029 -0.4126519 -1.7120553 0.0675547 0.2237865 0.07655 -0.3301296 -0.1188053 0.3089329 -0.1182336 -0.4459063 -0.6957249 -0.0629901 -0.0546769 0.1677115 -0.4385261 -0.3109775 0.2985069 -0.2072053 -0.7016496 0.2337456 0.0085014 0.0025186 0.0452582 0.1511514 -0.0083924 0.0385641 -0.007007 0.1463355 -0.0799833 -0.0195237 0.0017095 -0.0482209 0.0798826 -0.0143089 -0.026778 -0.0110529 0.0690388 0.8728451 0.0282181 -0.01604 0.1151247 0.2778187 -0.0873763 0.0777884 -0.0815885 0.2378271 0.0157458 -0.0343342 -0.0222618 -0.0418502 -0.0768959 0.0339473 -0.0517498 0.0434065 0.0478371 0.0127735 -0.0164479 -0.0542797 -0.0431099 0.0360495 0.0508822 -0.0623724 0.0395718 -0.0598226 0.1461961 -0.0392191 -0.0123387 -0.0728432 0.4418461 -0.314355 0.0338305 -0.2952316 0.4364353 1.6614672 -0.0689663 -0.0792645 -0.3326903 0.3353967 0.5176079 -0.5312154 0.4005966 0.8546872 -0.1066176 -0.0113764 0.0457454 -0.0455082 -0.0340134 0.0729337 0.0211885 0.0537233 -0.108934 -0.0999057 0.067225 0.0879145 0.0679261 -0.0294734 -0.0722315 0.0909572 -0.0720996 -0.0616234 0.0458326 -0.0206724 0.0092555 -0.0104799 -0.1702451 0.0047452 0.0371872 0.0415313 0.0749884 0.0346474 0.0098723 -0.0527237 0.0416499 0.0738569 0.0588654 -0.0328681 0.027639 -0.1426572 -0.0120551 -0.0115361 0.015796 -0.03669 0.0447267 0.0426806 -0.0577421 0.0292245 -0.0946862 -0.0223019 0.0358323 -0.0091742 -0.033716 -0.1047253 0.0089517 -0.0402508 0.0142197 0.0575265 -0.1805798 -0.1075824 -0.0227898 -0.0690389 0.044102 -0.0058466 -0.0459342 -0.0173391 0.0952972 0.012102 0.0990541 0.0985657 0.0749717 0.0030752 -0.0481453 0.1114948 -0.0917854 -0.0200558 0.0908448 0.0339301 -0.0853111 0.0219986 0.042062 0.0471711 -0.0568305 0.0876239 -0.1478174 0.0157189 0.0841124 0.1123947 0.0948749 0.0127287 -0.0912888 0.0832444 -0.0524903 -0.0317498 -0.190634 -0.0448247 -0.0784972 -0.0746561 0.0869848 -0.0165011 -0.0400204 -0.0042415 0.0622305 0.1073385 -0.0537169 0.0133612 -0.0207186 -0.1746063 0.0799003 0.0070536 0.043106 0.0465722 0.0352374 0.0621 0.0167741 0.0395016 -0.0373603 -0.011027 0.0044118 -0.0058243 -0.0142263 -0.0681513 -0.0807361 -0.052706 -0.0633033 0.0931916 -0.0357699 -0.0838748 -0.0412029 0.0493305 0.0767172 0.0481412 -0.0093576 0.0556757 -0.0043409 0.107185 -0.0204769 0.1223382 -0.0020903 0.1205908 0.0038456 0.0287915 0.0614326 -0.0091634 -0.0876622 0.041832 -0.0581816 0.0657648 unknown
polarizability: 124.4278906|1.1450873|88.6959246|3.545879|-5.8904507|96.4572669 unknown
InChI: InChI=1S/C8H15ClO2/c1-6(2)4-5-11-8(10)7(3)9/h6-7H,4-5H2,1-3H3
charge 0 multiplicity 1
26 atoms
Cl -3.292726 0.396591 -1.692695
O  -0.306676 -0.620855 -0.4027
O  -1.48127 0.494356 1.27892
C  3.516417 -0.111231 -0.379077
C  2.094173 -0.627591 -0.746974
C  0.974283 -0.028291 0.105406
C  3.681615 1.405317 -0.647195
C  3.917355 -0.466517 1.074363
C  -2.685591 -0.874306 -0.393792
C  -1.462155 -0.244872 0.269577
C  -3.817194 -1.168353 0.582582
H  4.215146 -0.645591 -1.056035
H  2.065968 -1.729355 -0.639865
H  1.885818 -0.400343 -1.810268
H  1.063255 -0.279211 1.17704
H  0.897129 1.069058 0.008125
H  4.732273 1.715168 -0.49726
H  3.059459 2.010635 0.038678
H  3.395765 1.664273 -1.683778
H  3.320342 0.101759 1.812459
H  4.980436 -0.223528 1.255489
H  3.776246 -1.544524 1.279008
H  -2.387637 -1.738328 -1.004413
H  -4.709333 -1.527482 0.044683
H  -3.497279 -1.95105 1.296952
H  -4.074519 -0.26503 1.158472
