program: Gaussian 09
title: 000143863
version: EM64L-G09RevD.01
frameworkgroup: C1[X(C8H14O2)]
method: RPBEPBE
basis: SDD
operation: Freq
keyword: #pfreq=noraman
keyword: PBEPBE/SDD
title: #p freq=noraman PBEPBE/SDD
converged: YES YES NO NO
title: Mulliken charges:
elementType: O O C C C C C C C C H H H H H H H H H H H H H H
charge: -0.267134 -0.246893 -0.380695 -0.233309 -0.678624 -0.581616 0.277898 -0.142282 -0.167452 -0.730294 0.214869 0.215722 0.220313 0.222222 0.212710 0.226056 0.213173 0.246462 0.241295 0.251172 0.214378 0.221635 0.223494 0.226900
chargesum: 0.00000
title: Mulliken charges with hydrogens summed into heavy atoms:
elementType: O O C C C C C C C C
charge: -0.267134 -0.246893 0.049896 0.209227 -0.026685 -0.093859 0.277898 0.108890 0.046926 -0.058265
polarizability: 1.31216042e+02 -4.26541677e+00 8.43017719e+01 5.54466867e+00 5.27544779e-01 7.12059337e+01
1716.lowfreq: -4.0239 0.0008 0.0010 0.0011 5.0909 13.6638 18.6607 49.0731 61.8963
frequency: 17.1986 49.0642 61.7639 79.7539 93.8434 146.5032 185.6335 193.1225 221.7743 253.7319 273.8293 293.6615 320.1959 432.3793 508.7848 571.9052 677.9540 756.6515 757.3005 864.5326 878.9763 890.9177 907.5476 943.8442 957.5992 979.7120 1045.2334 1050.8711 1087.9475 1095.5274 1136.3901 1139.6637 1142.1840 1194.2166 1225.9242 1265.4575 1278.3055 1291.6302 1303.9057 1336.5190 1372.8339 1394.0015 1397.6768 1436.5510 1462.1219 1471.4307 1471.6851 1478.3239 1480.7740 1490.7964 1639.2281 1696.1515 2957.1124 2966.7687 2980.4895 2997.7726 3005.0161 3041.0152 3043.8017 3065.2949 3069.3544 3072.4458 3084.3948 3085.8426 3090.4753 3115.5992
redmass: 3.7140 2.5449 2.7336 1.8509 2.4603 2.9867 2.8844 1.3297 1.1052 2.7094 2.5668 3.6163 5.0455 3.4074 3.4313 2.9291 4.6775 1.5712 1.0941 5.5685 1.1547 2.1580 2.1104 1.6688 3.2597 1.0863 1.5334 2.8446 3.6639 2.1368 2.1833 2.1687 1.6071 1.3855 1.2697 1.3544 1.1006 1.2428 1.3250 1.5467 1.5786 1.2425 1.2109 1.0877 1.0474 1.0619 1.0691 1.0578 1.0420 1.0856 10.2035 6.2029 1.0675 1.0366 1.0361 1.0594 1.0581 1.0971 1.1018 1.1045 1.0925 1.0912 1.0991 1.1047 1.0981 1.0897
irintensity: 0.4100 0.5732 0.2645 0.1581 0.6932 3.6247 2.8574 2.3812 0.0089 4.3796 4.0598 3.4673 12.4616 0.2664 3.3885 6.0401 4.4501 1.5053 5.5101 9.3247 2.1525 5.5384 5.0985 13.7331 94.8658 59.6790 0.4819 12.2635 12.1674 176.0952 3.1335 109.1951 28.0792 82.8814 1.3857 36.5633 0.0153 4.5370 0.9934 53.9393 3.2111 14.8823 11.2408 26.8585 14.7877 11.6107 6.2295 2.3912 12.7147 19.3768 178.9463 0.2767 14.9466 39.0857 31.4895 2.9039 42.9252 28.6564 0.6517 0.0087 3.4947 6.2430 42.0982 94.2449 42.5028 23.9450
temp: 298.150 k
press: 1.00000 atm
elementType: 8 8 6 6 6 6 6 6 6 6 1 1 1 1 1 1 1 1 1 1 1 1 1 1
symmnumber: 1
zpe: 534006.5 jmol-1
zpe.correction: 0.203392 hartree
zpe.thermalcorrener: 0.216059 hartree
zpe.thermalcorrenthalpy: 0.217003 hartree
zpe.thermalcorrgfe: 0.162471 hartree
zpe.sumelectzpe: -462.878428 hartree
zpe.sumelectthermal: -462.865761 hartree
zpe.sumelectthermalent: -462.864817 hartree
zpe.sumelectthermalfe: -462.919349 hartree
dipole: -0.7680 -1.7261 -0.3353
dipole: 1.9188
quadrupole: -49.8997 -65.4114 -60.5767
quadrupole: -1.7963 -0.0292 -1.3339
quadrupole: 8.7296 -6.7821 -1.9475 -1.7963 -0.0292 -1.3339
hfenergy: -463.08182 hartree
pointgroup: C01 [X(C8H14O2)]
dipole: 0.3049389 0.61067 0.3224752 debye
dipolederiv: -1.7347177 -0.1508707 -0.2818147 -0.177861 -0.4938263 -0.1300308 -0.4151894 -0.109839 -0.3845837 -0.7255862 0.0963456 -0.0094461 -0.2347495 -0.8365348 -0.2507876 -0.1877264 -0.1675615 -0.4158305 -0.0326433 0.0093775 -0.0317312 0.0513495 0.0803079 -0.0229552 -0.0202579 -0.0226695 0.130201 0.8522539 -0.0227351 0.0741431 -0.1818988 0.2384551 -0.0651474 0.0426994 -0.050411 0.3547313 -0.0478682 0.0272545 -0.020676 -0.0460613 0.0514892 -0.0200766 -0.0487973 -0.0102437 0.0868627 -0.2820547 0.0918127 -0.0144224 0.1109875 -0.0867408 -0.0396859 -0.0235449 0.0267759 0.1126923 1.7708249 -0.0189166 0.2718143 0.3381214 1.064473 0.4284836 0.562146 0.2838733 0.4178323 0.0921145 0.0537105 -0.0970335 0.2843343 -0.0444849 0.1011518 -0.0424232 0.1209352 -0.1045279 0.0900049 0.1294509 -0.133951 0.1433408 0.0488538 0.1277216 -0.1209097 0.1544211 -0.0637234 -0.1208523 -0.0809649 0.0596711 -0.0382354 0.0434042 -0.0254585 0.1204121 -0.00989 0.0563528 0.0525472 0.0027272 -0.0050917 -0.0234007 -0.0960559 0.096935 -0.0061169 0.1262736 0.0063276 0.0309968 0.0345204 0.0656633 0.003661 0.0530358 -0.0655936 0.0477534 -0.0831647 -0.1188911 -0.0457472 0.0141966 0.0029562 0.0677402 0.0421973 -0.0334505 0.0448002 -0.0605858 -0.1104992 -0.0452408 -0.0325748 0.0081463 0.0464739 -0.0684465 0.0880056 0.0057015 0.0924852 0.0015916 0.0632034 0.0307088 0.0368442 0.057558 0.0626151 -0.0602251 0.0970313 -0.0775609 -0.1362512 -0.1153283 -0.0881263 -0.076068 -0.1168365 0.0083073 -0.0603014 -0.0910146 -0.0544183 0.066585 0.0778979 -0.0243386 0.0317899 0.0372495 -0.0954328 0.1267118 0.0053193 0.1266019 0.0085279 0.0411433 -0.0043319 0.0025988 -0.0445541 0.0084772 -0.0788079 -0.0147557 -0.1213822 0.0177799 -0.0088771 0.0011791 0.0505233 -0.0353401 0.0698141 0.0727304 0.0562119 0.0823463 -0.0610955 0.0725435 -0.0531471 0.0149124 -0.1062433 -0.0065779 -0.0943479 0.0143276 -0.0969433 0.0824368 0.0372157 -0.096934 -0.001355 -0.086838 -0.0620562 -0.1262603 0.000837 -0.1198224 0.0633325 -0.1360274 0.0904006 -0.0044295 0.1044557 -0.0019493 0.0500485 -0.0592901 0.0296656 0.1126187 0.0361125 -0.0171266 0.0306172 -0.0870226 0.0853793 0.0799175 0.0636059 0.0773738 -0.1391963 0.0780847 0.0083821 0.0263389 -0.0662305 -0.0647039 -0.0985773 -0.0308195 -0.1362597 0.0167263 unknown
polarizability: 131.2525896|-0.1865722|79.6971495|-6.8085784|6.3163623|75.7740081 unknown
InChI: InChI=1S/C8H14O2/c1-3-5-6-8(9)10-7-4-2/h3,5H,4,6-7H2,1-2H3
charge 0 multiplicity 1
24 atoms
O  1.153326 0.45284 -0.147907
O  0.023777 -1.364632 -1.071146
C  3.517755 0.542876 0.417781
C  2.414343 -0.351626 -0.148412
C  4.87403 -0.196557 0.457237
C  -1.177767 0.762961 -0.646759
C  0.017445 -0.184445 -0.652646
C  -2.491693 0.037273 -0.432261
C  -3.453062 0.444222 0.435018
C  -4.775347 -0.257732 0.649782
H  3.598477 1.454643 -0.203105
H  3.232069 0.870308 1.434857
H  2.626047 -0.673382 -1.185368
H  2.251825 -1.257134 0.465263
H  5.189728 -0.512852 -0.554582
H  5.66411 0.457014 0.867123
H  4.821682 -1.100557 1.092379
H  -1.015648 1.554475 0.103843
H  -1.180178 1.262189 -1.640267
H  -2.637379 -0.871309 -1.032718
H  -3.277293 1.349204 1.038391
H  -5.626749 0.412477 0.420202
H  -4.892305 -0.572024 1.70533
H  -4.862891 -1.155032 0.012564
