program: Gaussian 09
title: 000143854
version: EM64L-G09RevD.01
frameworkgroup: C1[X(C4H8O)]
method: RPBEPBE
basis: SDD
operation: Freq
keyword: #p
keyword: freq=noraman
keyword: PBEPBE/SDD
title: #p freq=noraman PBEPBE/SDD
converged: YES YES NO NO
title: Mulliken charges:
elementType: O C C C C H H H H H H H H
charge: -0.441066 -0.450404 -0.671856 0.395632 -0.729364 0.220995 0.212522 0.216790 0.214496 0.241696 0.209103 0.232511 0.348946
chargesum: 0.00000
title: Mulliken charges with hydrogens summed into heavy atoms:
elementType: O C C C C
charge: -0.092120 -0.016887 0.001126 0.395632 -0.287750
polarizability: 5.71572013e+01 5.74435248e+00 4.98603857e+01 5.21625028e+00 1.47143544e+00 3.43531551e+01
1716.lowfreq: -17.5806 -3.7773 0.0003 0.0004 0.0011 17.4789 80.9532 205.6927 238.9554
frequency: 80.9411 205.6752 238.9551 396.9107 437.6891 456.9366 602.7496 692.8818 783.3906 796.8191 851.7269 931.0789 997.8303 1051.2688 1079.2367 1158.3897 1248.9201 1310.4378 1348.2548 1387.2227 1430.8783 1460.9818 1472.8610 1489.9720 1662.1777 2989.3700 2995.4686 3061.5966 3084.7810 3103.2987 3105.1832 3221.9554 3569.0071
redmass: 2.4201 1.0918 2.8269 2.0997 1.0961 2.4434 2.6161 1.2496 1.6679 1.7075 1.3664 2.1192 1.6096 2.0459 1.6341 1.4575 1.2026 1.3599 2.1521 1.2276 1.1737 1.1009 1.0419 1.0651 5.6618 1.0352 1.0627 1.0983 1.1004 1.1000 1.0661 1.1116 1.0655
irintensity: 1.1222 0.4971 3.2742 1.4249 134.3952 17.1457 7.2922 4.1550 0.5826 6.0445 127.7420 40.3715 23.9451 51.8442 8.4878 94.5326 0.3447 1.0105 15.0192 11.3300 6.0630 7.3384 13.3625 13.7996 129.1886 37.6681 20.8116 9.8715 44.6825 34.0583 8.8626 14.1927 11.6515
temp: 298.150 k
press: 1.00000 atm
elementType: 8 6 6 6 6 1 1 1 1 1 1 1 1
symmnumber: 1
zpe: 291319.7 jmol-1
zpe.correction: 0.110958 hartree
zpe.thermalcorrener: 0.117192 hartree
zpe.thermalcorrenthalpy: 0.118136 hartree
zpe.thermalcorrgfe: 0.081665 hartree
zpe.sumelectzpe: -232.007948 hartree
zpe.sumelectthermal: -232.001714 hartree
zpe.sumelectthermalent: -232.000770 hartree
zpe.sumelectthermalfe: -232.037240 hartree
dipole: -0.6520 -0.2538 -0.3017
dipole: 0.7619
quadrupole: -27.7077 -31.1542 -33.2417
quadrupole: -3.2721 1.9594 -1.1144
quadrupole: 2.9935 -0.4530 -2.5405 -3.2721 1.9594 -1.1144
hfenergy: -232.1189055 hartree
pointgroup: C01 [X(C4H8O1)]
dipole: -0.2348474 -0.169573 -0.0771172 debye
dipolederiv: -0.2635302 0.3029832 -0.0145016 0.0743063 -1.0518876 0.2056583 0.0547573 0.2947557 -0.4721485 -0.0639352 0.0233894 -0.0318361 -0.0483258 0.0984807 0.0140814 0.0067554 0.0580582 0.099706 0.0043894 -0.0253719 0.0426757 0.0074609 0.0652456 0.0314519 -0.0238837 0.0111903 0.0203637 0.5413276 -0.0104074 0.1719196 0.1000318 1.0966333 -0.2607226 0.1904839 -0.3097693 0.1408299 -0.3303863 -0.2603489 0.2103536 -0.1135164 -0.4356362 -0.0742176 0.1339716 -0.1328769 -0.4689375 0.0299405 -0.0248167 -0.0027948 -0.0203798 -0.016034 -0.1407729 -0.0139966 -0.1134564 -0.046487 0.039328 -0.0085747 0.0070681 0.0303967 -0.1013536 0.131137 -0.0015869 0.0817285 0.0364319 0.0840909 -0.0249055 0.0008206 0.0122772 -0.0386759 -0.1407265 0.0458023 -0.1096769 -0.0528886 -0.196546 -0.0231158 -0.0731611 -0.0133811 0.1024132 0.0033088 -0.0908515 0.0046438 0.0337643 0.1108679 0.0495108 -0.0085394 0.0048557 -0.0795421 0.1014089 0.0109777 0.0829117 0.0379565 -0.0811767 0.0122571 -0.1228821 0.0322393 0.073575 0.0622386 -0.1433988 0.0491134 0.1720141 0.0839188 0.0508735 -0.0694477 0.0368715 -0.0253886 0.081625 -0.0632751 0.0874058 0.1630457 0.0417113 -0.061473 -0.1096749 -0.1028364 0.3121703 -0.0144704 -0.1057556 -0.0040279 0.3363495 unknown
polarizability: 54.9756004|8.039342|51.1771724|3.4352303|-3.4130856|35.2179693 unknown
InChI: InChI=1S/C4H8O/c1-3-4(2)5/h5H,2-3H2,1H3
charge 0 multiplicity 1
13 atoms
O  -0.825259 1.150453 -0.437398
C  0.888057 -0.162741 0.620571
C  1.971452 0.113149 -0.453542
C  -0.515081 -0.136621 0.059807
C  -1.386145 -1.181077 0.021722
H  0.962057 0.605251 1.415238
H  1.060689 -1.145043 1.094399
H  1.958074 -0.666803 -1.235722
H  2.976829 0.126356 0.004806
H  1.795448 1.088932 -0.936751
H  -2.393891 -1.093044 -0.402709
H  -1.097662 -2.155846 0.419656
H  -1.742968 1.167135 -0.808977
